{"text_format":"1","workbook":"xlsx","n_sheets":18,"sheets":["Recalculate","Counties","Culvert Shapes","ConditIonal Formats","Culvert Roads","Small Bridge Roads","Unique","Import Culverts","Import Bridges","Culverts","Small_Bridges","Culvert_Detail_Template","Bridge_Detail_Template","Small_Bridge_Summary","Culvert_Summary","Improvement _List_Template","Culvert_Application Template","Bridge Application Template"],"not_rendered":{"charts":0,"images":9,"macros":1,"external_links":0,"defined_names":19,"comments":0,"pivot_tables":0},"unopened":[],"bounds":{"document_bytes":16777216,"sheet_cells":100000,"rows_first":2000,"rows_last":500,"rows_between":2000,"halvings":0,"cell_chars":16384,"cell_head_chars":4096},"cells_cut":0,"cells_raw":0,"read":"row_number_cap","date_system":"1900"}

{"sheet":"Recalculate","index":0,"n_rows":0,"n_cols":0,"rows_kept":0,"cut":false,"hidden":true,"merged":[]}

{"sheet":"Counties","index":1,"n_rows":67,"n_cols":4,"rows_kept":67,"cut":false,"hidden":true,"merged":[]}
["Name","Code","MinLong","MaxLat"]
["Aurora","02",-98.807780125180301,43.9377154817088]
["Beadle","03",-98.705771200454905,44.6341665479966]
["Bennett","04",-102.11082889289,43.390180129999003]
["Bon Homme","05",-98.162962807507,43.169640415044]
["Brookings","06",-97.129679715063901,44.543890690443199]
["Brown","07",-98.725386361740902,45.938738719290399]
["Brule","08",-99.469231261874,43.935230444970898]
["Buffalo","09",-99.576580364128802,44.1967934604126]
["Butte","10",-104.057889623514,45.213407205064101]
["Campbell","11",-100.499380881829,45.9436605756527]
["Charles Mix","12",-99.310738192986094,43.499863350445601]
["Clark","13",-97.982973048002293,45.153302672722802]
["Clay","14",-97.160760548263298,43.083742461844899]
["Codington","15",-97.494671921581201,45.151911730104203]
["Corson","16",-102.00099323005099,45.944852461267701]
["Custer","17",-104.055497440167,43.856796104554199]
["Davison","18",-98.326097961390801,43.851468473222099]
["Day","19",-97.981801085878701,45.588490731231701]
["Deuel","20",-96.885539704611205,44.977657764695302]
["Dewey","21",-101.501082986125,45.473048515231703]
["Douglas","22",-98.707251028145706,43.499326392071097]
["Edmunds","23",-99.709053560956306,45.593398595791498]
["Fall River","24",-104.054832382889,43.478836990512697]
["Faulk","25",-99.573770519733799,45.245545563603102]
["Grant","26",-97.226426884896597,45.326887771358898]
["Gregory","27",-99.534491253478507,43.499811331603503]
["Haakon","28",-102.00774897731,44.747133374077599]
["Hamlin","29",-97.492319867731496,44.804552708086803]
["Hand","30",-99.312591362023298,44.897234537087698]
["Hanson","31",-97.968436887346996,43.850695495871001]
["Harding","32",-104.045557783406,45.945384319303002]
["Hughes","33",-100.580880667088,44.548436443299003]
["Hutchinson","34",-98.114766881933704,43.499906467538203]
["Hyde","35",-99.676428444175002,44.897522510069997]
["Jackson","36",-102.139241929912,43.995157250217197]
["Jerauld","37",-98.927181159219003,44.196867494740502]
["Jones","38",-101.064394710768,44.168799341382801]
["Kingsbury","39",-97.853673911119202,44.544432605774702]
["Lake","40",-97.370359768288594,44.196088595343099]
["Lawrence","41",-104.055981551757,44.604807139629699]
["Lincoln","42",-96.924913560570303,43.5004635446519]
["Lyman","43",-100.367256570591,44.2176404198973]
["Marshall","46",-97.979649155279105,45.936146821684602]
["McCook","44",-97.609104785546293,43.849066522557699]
["McPherson","45",-99.718080674557598,45.9410916463858]
["Meade","47",-103.57440638607299,45.039665264686299]
["Mellette","48",-101.22843567634401,43.857961265840203]
["Miner","49",-97.851420864448002,44.195471555625097]
["Minnehaha","50",-97.1295176531669,43.849514605345]
["Moody","51",-96.889245648436898,44.196787654370198]
["Oglala Lakota","57",-103.001037144834,43.706189159347801]
["Pennington","52",-104.055497440167,44.510933274915502]
["Perkins","53",-102.95755238192601,45.945276397818802]
["Potter","54",-100.424175705156,45.246823508863898]
["Roberts","55",-97.228323002129997,45.935988875360501]
["Sanborn","56",-98.332185028461396,44.196758523303203]
["Spink","58",-98.717776291976193,45.243739628957599]
["Stanley","59",-101.167057776493,44.783744396673001]
["Sully","60",-100.729328753454,44.898302455963503]
["Todd","61",-101.22827667036501,43.3904442653186]
["Tripp","62",-100.231000431626,43.766571358856702]
["Turner","63",-97.401458691931296,43.500014521194998]
["Union","64",-96.806551432097194,43.0838774783007]
["Walworth","65",-100.486592810533,45.594830538727201]
["Yankton","68",-97.637504710045704,43.169985456974899]
["Ziebach","69",-102.000472085076,45.4728784060121]

{"sheet":"Culvert Shapes","index":2,"n_rows":10,"n_cols":5,"rows_kept":10,"cut":false,"hidden":true,"merged":[]}
["Shape","Factor =\n            Area (ft2 )            \n    [rise (in) * span(in)]",null,"Maintenance Level","Short\nVersion"]
["Arch",{"$f":"0.78/144","v":5.4166666666666669E-3},null,"Full Maintenance","Full"]
["Cattle Pass",{"$f":"0.78/144","v":5.4166666666666669E-3},null,"Minimum Maintenance","Minimum"]
["Elliptical",{"$f":"PI()/4/144","v":5.4541539124822796E-3},null,"No Maintenance","No"]
["Open Bottom",{"$f":"0.78/144","v":5.4166666666666669E-3},null,{"$f":"\" \"","v":" "}]
["Other",{"$f":"0.78/144","v":5.4166666666666669E-3}]
["Pipe Arch",{"$f":"0.78/144","v":5.4166666666666669E-3}]
["Rectangle",{"$f":"1/144","v":6.9444444444444441E-3}]
["Round",{"$f":"PI()/4/144","v":5.4541539124822796E-3}]
[{"$f":"\"\"","v":""},{"$f":"0.78/144","v":5.4166666666666669E-3}]

{"sheet":"ConditIonal Formats","index":3,"n_rows":60,"n_cols":62,"rows_kept":60,"cut":false,"hidden":true,"merged":[]}
[null,"Field","Item 1\nCounty Name","Item 2\nTown or Township Name","Item 3\nRoad System","Item 4\nSmall Structure\n Local Identifier","Item 5\nSequence\nNumber","Item 6\nInventoried By","Item 7\nInventory Date","Item 8\nLatitude","Item 9\nLongitude","Item 10\nSmall Structure Number","Item 11\nRoad Name","Item 12\nRoad Maintenance Level","Item 13\nRoad Surface","Item 14\nNumber Served","Item 15\nDetour Length (in miles)","Item 16\nCulvert Purpose","Item 17\nCulvert Location","Item 18\nWater Overtop Frequency","Item 19\nCulvert Type","Item 20\nNumber of Cells","Item 21\nMaterial","Item 22\nLining","Item 23\nShape","Item 24\nSpan\n(in inches)","Item 25 Rise\n(in inches)","Item 26\nBarrel Length (in feet)","Item 27\nLength Along Roadway (in feet)","Item 28\nSkew Angle","Item 29\nCover Height\n(in feet)","Item 30\nCrushing","Item 31 Joint Separation","Item 32\nInfiltration","Item 33 Material Deterioration","Item 34 Damage","Item 35\nPlugging","Item 36 Embankment Settlement","Item 37\nRoad Surface Distress","Item 38\nInlet\nEnd Treatment","Item 39 Perched Inlet","Item 40\nInlet\nWater Level","Item 41\nInlet\nErosion Control","Item 42 Inlet Erosion","Item 43\nInlet \nErosion Outside\n of Right of Way","Item 44\nOutlet\nEnd Treatment","Item 45\nPerched Outlet","Item 46\nOutlet\nWater Level","Item 47\nOutlet\nErosion Control","Item 48\nOutlet Erosion","Item 49\nOulet\nErosion Outside\nof Right of Way","Item 65\nYear Constructed","Item 66 Overall Structure Condition","Item 67\nOther Comments","Item 68\nTraffic Status","Item 69\nAxle Weight Load Posting","Item 70 Load Posting for Single Unit Vehicles","Item 71 Load Posting for Combination Vehicles","Item 72\nLoad Rating Evaluation Recommended","Item 73\nFurther Inspection Needed","X","Y"]
["Rule","Column",{"$f":"MID(ADDRESS(ROW(),COLUMN()+COLUMN($AI3)-COLUMN($C3)),2,SEARCH(\"$\",ADDRESS(ROW(),COLUMN()+COLUMN($AI3)-COLUMN($C3)),2)-2)","v":"AI"},{"$f":"MID(ADDRESS(ROW(),COLUMN()+COLUMN($AI3)-COLUMN($C3)),2,SEARCH(\"$\",ADDRESS(ROW(),COLUMN()+COLUMN($AI3)-COLUMN($C3)),2)-2)","v":"AJ"},"AK","AL","AM","AN","AO","AP","AQ","AR","AS","AT","AU","AV","AW","AX","AY","AZ","BA","BB","BC","BD","BE","BF","BG","BH","BI","BJ","BK","BL","BM","BN","BO","BP","BQ","BR","BS","BT","BU","BV","BW","BX","BY","BZ","CA","CB","CC","CD","CE","CF","CG","CH","CI","CJ","CK","CL","CM","CN","CO","CP"]
["=\"\"",null,13,"13,29",13,13,13,13,"9,13",13,13,13,13,13,"6,13","6,13",13,13,13,13,13,13,13,13,13,13,13,13,13,13,13,13,13,13,13,13,13,13,13,13,13,13,13,13,13,13,13,13,13,13,13,13,13,13,13,16,16,16,3,3]
["=\" \"",null,10,10,10,10,10,10,"7,10",10,10,10,10,10,"4,10","4,10",10,10,10,10,10,10,10,10,10,10,10,10,10,10,10,10,10,10,10,10,10,10,10,10,10,10,10,10,10,10,10,10,10,10,10,10,"10,18",10,10,null,null,null,1,1]
["=\" \"",null,null,null,null,null,null,null,null,null,null,null,null,null,null,null,null,null,null,null,null,null,null,null,null,null,null,null,null,null,null,null,null,null,null,null,null,null,null,null,null,null,null,null,null,null,null,null,null,null,null,19]
["=0",null,11,11,11,11,11,11,"8,11",11,11,11,11,11,"5,11","5,11","11,20",11,11,11,11,11,11,11,11,11,11,11,11,null,11,11,11,11,11,11,11,11,11,11,11,11,11,11,11,11,11,11,11,11,11,11,11,"11,26","11,26",null,null,null,"2,26","2,26"]
["=0",null,null,null,null,null,null,null,null,null,null,null,null,14,null,null,null,null,null,null,null,17,null,null,null,15,15,null,null,null,null,null,null,null,null,null,null,null,null,null,null,null,null,null,null,null,null,null,null,null,null,null,null,null,27,null,null,null,27,27]
["<5",null,null,null,null,null,null,null,null,null,null,null,null,null,null,null,null,null,null,null,null,null,null,null,null,null,null,null,null,null,null,null,null,null,null,null,null,null,null,null,null,null,null,null,null,null,null,null,null,null,null,null,null,null,null,25,25,25]
[">45"]
[">60",null,null,null,null,null,null,null,null,null,null,null,null,null,null,null,null,null,null,null,null,null,null,null,null,null,null,null,null,21]
["=0","(no format)",null,null,null,null,null,null,null,null,null,null,null,null,null,null,null,null,null,null,null,null,null,null,null,null,null,null,null,null,null,null,null,null,null,null,null,null,null,null,null,null,null,null,null,null,null,null,null,null,null,null,null,null,null,24,24,24]
["AND($CI3=\"Posted for load\",SUM($CJ3:$CL3)=0)",null,null,null,null,null,null,null,null,null,null,null,null,null,null,null,null,null,null,null,null,null,null,null,null,null,null,null,null,22,null,null,null,null,null,null,null,null,null,null,null,null,null,null,null,null,null,null,null,null,null,null,null,null,null,23,23,23]
["=AND(G3=\"Township\",AJ3=\"\")",null,null,28]
["=AND(COUNTIFS($W$3:$W$187,$W3)>1,$BB3>1)",null,null,null,null,null,null,null,null,null,null,null,null,null,null,null,null,null,null,null,null,30]
[]
[]
[null,"Field","Reported\nSystem","County","Secondary","Township","Other","All\nSystems","Mapped\nSystem\n(changes\n in red)","Eligible\nSystem","Highway\nMaintenance\nLevel","Seq #","No\nNearby\nCulvert","Nearest\nCulvert\nN & W\n(row)","Nearest\nCulvert\nN & W\nSmall\nStructure\nNumber","Distance\nto Nearest\nCulvert\nN & W\n(ft)","Nearest\nN & W\nCulvert\nw/in 120'\n(row)","Nearest\nCulvert\nS & E\n(row)","Nearest\nCulvert\nS & E\nSmall\nStructure\nNumber","Distance\nto Nearest\nCulvert\nS & E\n(ft)","Nearest\nS & E\nCulvert\nw/in 120'\n(row)","Start\nGroup","With\nGroup","# in\nGroup","Group\nwith Small\nStructure\n(row)","Group\nwith Small\nStructure\nNumber","Number of\nBarrels\n(changes\nin red)","Estimated\nCulvert\nOutlet Area\nft2","Number\nof\nBarrels\n≥16ft2","Number\n of\nBarrels","Culvert\nGroup\nEstimated\nOutlet Area ft2","Number\nof\nBarrels\n<16ft2","Small\nPipe\nEstimated\nOutlet\nArea ft2","# of\nOther\nGroups\n>16ft2","Total\nPossible\nSmall\nStructures","Eligible\nSmall\nStructures"]
["Rule","Column",{"$f":"MID(ADDRESS(ROW(),COLUMN()+COLUMN($A3)-COLUMN($C3)),2,SEARCH(\"$\",ADDRESS(ROW(),COLUMN()+COLUMN($A3)-COLUMN($C3)),2)-2)","v":"A"},{"$f":"MID(ADDRESS(ROW(),COLUMN()+COLUMN($A3)-COLUMN($C3)),2,SEARCH(\"$\",ADDRESS(ROW(),COLUMN()+COLUMN($A3)-COLUMN($C3)),2)-2)","v":"B"},"C","D","E","F","G","H","I","J","K","L","M","N","O","P","Q","R","S","T","U","V","W","X","Y","Z","AA","AB","AC","AD","AE","AF","AG","AH"]
["=0",null,null,null,null,null,null,null,null,null,null,null,null,null,null,null,null,null,null,null,null,null,null,null,null,null,null,null,null,null,null,null,null,null,null,1]
["<16",null,null,null,null,null,null,null,null,null,null,null,null,null,null,null,null,null,null,null,null,null,null,null,null,null,null,2]
["UNKNOWN",null,null,null,null,null,null,null,null,8,5,null,null,null,null,null,null,null,null,null,null,null,null,null,null,null,null,3]
["<> \"\"",null,null,null,null,null,null,null,null,null,null,null,4]
["<> \"Full\"",null,null,null,null,null,null,null,null,null,6]
["No",null,null,null,null,null,null,null,null,7]
["Y3<>A3","AaBbCc",null,null,null,null,null,null,null,null,null,null,null,null,null,null,null,null,null,null,null,null,null,null,null,null,9]
["LEN(F3)=0",null,null,null,null,null,null,null,10]
["G3<>A3","AaBbCc",null,null,null,null,null,null,11]
[]
[]
[]
[]
[null,"Field","Item 1\nCounty Name","Item 2\nTown or Township Name","Item 3\nRoad System","Item 4\nSmall Structure Local Identifier","Item 6\nInventoried By","Item 7\nInventory Date","Item 8\nLatitude","Item 9\nLongitude","Item 10\nSmall Structure Number","Item 11\nRoad Name","Item 12\nRoad Maintenance Level","Item 13\nRoad Surface","Item 14\nNumber Served","Item 15\nDetour Length (in miles)","Item 50\nStructure Design Type","Item 51\nStructure Material","Item 52\nOverall Length (in feet)","Item 53\nNBIS Length","Item 54\nNumber of Spans","Item 55\nTraffic Lanes","Item 56\nDeck Width\n(in feet)","Item 57\nRoadway Width\n(in feet)","Item 58\nSkew Angle","Item 59\nDeck Condition","Item 60\nSuperstructure Condition","Item 61\nSubstructure Condition","Item 62\nChannel Condition","Item 63\nBridge Rail Condition","Item 64\nApproach Rail","Item 65\nYear Constructed","Item 66\nOverall Structure Condition","Item 67\nOther Comments","Item 68\nTraffic Status","Item 69\nAxle Weight Load Posting","Item 70\nLoad Posting for Single Unit Vehicles","Item 71\nLoad Posting for Combination Vehicles","Item 72\nLoad Rating Evaluation Recommended","Item 73\nFurther Inspection Needed","X","Y"]
["Rule","Column",{"$f":"MID(ADDRESS(ROW(),COLUMN()+COLUMN($L34)-COLUMN($C34)),2,SEARCH(\"$\",ADDRESS(ROW(),COLUMN()+COLUMN($L34)-COLUMN($C34)),2)-2)","v":"L"},{"$f":"MID(ADDRESS(ROW(),COLUMN()+COLUMN($L34)-COLUMN($C34)),2,SEARCH(\"$\",ADDRESS(ROW(),COLUMN()+COLUMN($L34)-COLUMN($C34)),2)-2)","v":"M"},"N","O","P","Q","R","S","T","U","V","W","X","Y","Z","AA","AB","AC","AD","AE","AF","AG","AH","AI","AJ","AK","AL","AM","AN","AO","AP","AQ","AR","AS","AT","AU","AV","AW","AX","AY"]
["=\"\"",null,5,2,13,13,13,13,13,13,13,13,null,13,13,13,13,13,null,null,13,13,13,13,null,13,13,13,13,13,13,13,13]
["=\" \"",null,3,null,9,9,9,9,9,9,9,9,null,9,9,9,9,9,null,null,9,9,9,9,7,9,9,9,9,9,9,9,9,null,null,null,null,null,15,15]
["=\" \""]
["=0",null,4,null,12,12,12,12,12,12,12,12,null,12,12,12,12,12,null,null,12,12,12,12,null,12,12,12,12,12,12,12,12,null,null,null,null,null,14,14]
["=0",null,null,null,null,null,null,null,null,null,null,null,8]
["<5 (orange in culverts)",null,null,null,null,null,null,null,null,null,null,null,null,null,null,null,null,null,null,null,null,null,null,null,null,null,null,null,null,null,null,null,null,null,null,18,18,18]
[">45",null,null,null,null,null,null,null,null,null,null,null,null,null,null,null,null,null,null,null,null,null,null,null,11]
[">60",null,null,null,null,null,null,null,null,null,null,null,null,null,null,null,null,null,null,null,null,null,null,null,10]
["=0",null,null,null,null,null,null,null,null,null,null,null,null,null,null,null,null,null,6,6]
["LEN(F3)=0"]
["=0","(no format)",null,null,null,null,null,null,null,null,null,null,null,null,null,null,null,null,null,null,null,null,null,null,null,null,null,null,null,null,null,null,null,null,null,17,17,17]
["G3<>A3","AaBbCc"]
["Unknown"]
["UNKNOWN"]
["AND(AR3=\"Posted for load\", sum($AS3:AU___\"_",null,null,null,null,null,null,null,null,null,null,null,null,null,null,null,null,null,null,null,null,null,null,null,null,null,null,null,null,null,null,null,null,null,null,16,16,16]
["AND(G3=\"Township\",___)",null,null,1]
[]
[]
[null,"Field","Reported\nSystem","County","Secondary","Township","Other","All\nSystems","Mapped\nSystem\n(changes\n in red)","Eligible\nSystem","Highway\nMaintenance\nLevel","NBIS\nBridge\nLength\n(ft)","Bridge\nRAIF\nEligible"]
["Rule","Column",{"$f":"MID(ADDRESS(ROW(),COLUMN()+COLUMN($A37)-COLUMN($C37)),2,SEARCH(\"$\",ADDRESS(ROW(),COLUMN()+COLUMN($A37)-COLUMN($C37)),2)-2)","v":"A"},{"$f":"MID(ADDRESS(ROW(),COLUMN()+COLUMN($A37)-COLUMN($C37)),2,SEARCH(\"$\",ADDRESS(ROW(),COLUMN()+COLUMN($A37)-COLUMN($C37)),2)-2)","v":"B"},"C","D","E","F","G","H","I","J","K"]
["No",null,null,null,null,null,null,null,null,9,null,null,14]
[">20",null,null,null,null,null,null,null,null,null,null,13]
["UNKNOWN",null,null,null,null,null,null,null,null,10]
["UNKNOWN",null,null,null,null,null,null,null,null,null,11]
["<> Full",null,null,null,null,null,null,null,null,null,12]
["LEN(F3)=0",null,null,null,null,null,null,null,"1,3,5,7"]
["G3<>A3","AaBbCc",null,null,null,null,null,null,"2,4,6,8"]

{"sheet":"Culvert Roads","index":4,"n_rows":7234,"n_cols":5,"rows_kept":7234,"cut":false,"hidden":true,"merged":[[1,4,8,4],[9,4,15,4],[16,4,22,4]]}
["County","Secondary","Township","Other","as of 08/19/2024"]
["03-0000-0000","04-0249-1903","02-0021-0418","39-2051-1537","This file is created by pasting in the Small Structure Inventory number from four separate files created by Kathryn Wesson of SDDOT's GIS group. Each of the four files lists culverts, the reported latitude and longitude of which place them within 50' of a defined road system (County, County Secondary, Township, and Other). "]
["03-0022-1230","04-0249-1904","02-0036-0417","39-2051-1538"]
["03-0022-1315","04-0339-0511","02-0099-2332","39-2051-1539"]
["03-0022-1373","04-0449-1990","02-0099-2333","43-4969-1684"]
["03-0022-1535","04-0449-1991","02-0099-2334","43-4970-1684"]
["03-0022-1584","04-0865-1603","02-0099-2335","43-4971-1684"]
["03-0022-1595","04-0891-1603","02-0099-2336","52-5586-2958"]
["03-0022-1654","04-1538-1914","02-0099-2337","54-0748-1308"]
["03-0022-1821","04-1538-1915","02-0100-0129","54-0748-1309","The Culverts worksheet uses this information to verify the road system reported for the structure in the Small Structure Inventory and to determine whether the structure is eligible for Rural Access Infrastructure Funding. (Only structures on Township and County Secondary roads are eligible.)"]
["03-0022-1857","04-1637-1893","02-0100-0407","54-0753-1271"]
["03-0022-1948","04-1909-1409","02-0105-1028","57-3746-4297"]
["03-0022-1972","04-2081-0207","02-0106-1028","57-3746-4321"]
["03-0022-2036","04-2109-1488","02-0111-2930","57-3747-4436"]
["03-0022-2136","04-2511-0609","02-0111-2931","57-3747-4452"]
["03-0022-2189","04-2565-1309","02-0112-2930","57-3847-4475"]
["03-0022-2212","04-2794-1309","02-0165-0679",null,"The information in this worksheet should be updated prior to local agencies updating the Small Structure Inventory each spring and again immediately before tallying the number of eligible small structure on June 1 of each year."]
["03-0022-2221","04-3002-1300","02-0165-0883"]
["03-0022-2239","04-3002-1301","02-0165-0884"]
["03-0022-2363","04-3011-0308","02-0167-1241"]
["03-0023-2193","04-3194-1610","02-0167-1242"]
["03-0023-2368","04-3194-1611","02-0176-2233"]
["03-0023-2427","04-3562-1610","02-0199-0033"]
["03-0023-2428","04-4433-2000","02-0202-0726"]
["03-0023-2488","04-4433-2001","02-0218-0927"]
["03-0023-2513","04-4437-2705","02-0231-2530"]
["03-0023-2531","04-4437-2706","02-0232-2530"]
["03-0024-2596","05-0204-1801","02-0232-2531"]
["03-0024-2625","05-0266-1802","02-0232-2532"]
["03-0024-2629","05-0283-1802","02-0256-0726"]
["03-0024-2643","05-0298-0801","02-0266-1221"]
["03-0024-2649","05-0298-0802","02-0266-1222"]
["03-0024-2667","05-0372-2308","02-0280-0827"]
["03-0024-2683","05-0373-1643","02-0284-1936"]
["03-0024-2684","05-0378-0902","02-0295-1936"]
["03-0024-2690","05-0395-1063","02-0298-0282"]
["03-0024-2762","05-0395-1134","02-0341-0316"]
["03-0024-2782","05-0455-1502","02-0366-2740"]
["03-0024-2826","05-0457-0109","02-0367-2740"]
["03-0025-2868","05-0472-1496","02-0367-2741"]
["03-0025-2926","05-0472-1649","02-0375-0728"]
["03-0025-2927","05-0472-2172","02-0395-2830"]
["03-0025-2934","05-0530-2400","02-0395-2831"]
["03-0027-1520","05-0552-0902","02-0403-0728"]
["03-0027-2622","05-0579-2001","02-0404-0728"]
["03-0047-1920","05-0617-0709","02-0433-2930"]
["03-0050-1520","05-0644-0504","02-0435-2930"]
["03-0092-2622","05-0655-0503","02-0435-2931"]
["03-0109-2421","05-0658-0305","02-0497-0335"]
["03-0114-1519","05-0671-1432","02-0498-0475"]
["03-0125-1920","05-0671-1692","02-0498-0476"]
["03-0125-2687","05-0671-2120","02-0500-0605"]
["03-0126-2629","05-0671-2121","02-0596-0138"]
["03-0126-2683","05-0682-2400","02-0596-0139"]
["03-0126-2695","05-0686-1702","02-0596-0176"]
["03-0127-2421","05-0755-1203","02-0597-0563"]
["03-0128-2421","05-0768-0045","02-0657-0415"]
["03-0130-2421","05-0771-1703","02-0675-0415"]
["03-0147-2722","05-0804-1303","02-0676-0415"]
["03-0150-1519","05-0814-1001","02-0684-0441"]
["03-0159-1920","05-0822-0305","02-0684-0442"]
["03-0159-2421","05-0867-0042","02-0758-2751"]
["03-0179-1519","05-0868-0143","02-0758-2752"]
["03-0182-0601","05-0869-1249","02-0782-0294"]
["03-0196-0002","05-0873-0432","02-0782-0295"]
["03-0196-0050","05-0873-0482","02-0783-0184"]
["03-0196-0193","05-0874-0548","02-0959-2609"]
["03-0196-0218","05-0875-0589","02-1027-0211"]
["03-0197-0243","05-0929-2002","02-1097-2536"]
["03-0197-0329","05-0938-0902","02-1097-2537"]
["03-0197-0363","05-0949-1971","02-1262-0309"]
["03-0197-0400","05-0971-1348","02-1287-2931"]
["03-0198-0401","05-0971-1349","02-1320-0007"]
["03-0198-0454","05-0972-1453","02-1378-0048"]
["03-0198-0479","05-0993-2680","02-1378-0049"]
["03-0198-0534","05-0996-1302","02-1407-1281"]
["03-0198-0549","05-1046-2485","02-1513-0788"]
["03-0198-0593","05-1068-0133","02-1538-1804"]
["03-0198-2722","05-1068-0144","02-1544-1734"]
["03-0215-2421","05-1070-0240","02-1544-1735"]
["03-0218-1519","05-1070-0241","02-1544-1736"]
["03-0225-2779","05-1070-2400","02-1566-1230"]
["03-0225-2780","05-1073-0705","02-1567-1229"]
["03-0226-2728","05-1073-2349","02-1594-0610"]
["03-0232-2421","05-1074-0630","02-1630-1934"]
["03-0247-0001","05-1115-2062","02-1649-1025"]
["03-0247-0002","05-1131-0206","02-1650-1025"]
["03-0251-2822","05-1132-0206","02-1674-0255"]
["03-0255-0601","05-1134-2003","02-1674-0379"]
["03-0257-2421","05-1141-1103","02-1675-0460"]
["03-0263-0002","05-1165-0102","02-1711-1191"]
["03-0275-2421","05-1262-1100","02-1722-0206"]
["03-0278-1519","05-1262-1101","02-1845-2875"]
["03-0282-1920","05-1271-0677","02-1845-2889"]
["03-0283-0602","05-1272-1874","02-1846-2902"]
["03-0286-2822","05-1273-0564","02-1848-3000"]
["03-0287-2421","05-1273-2000","02-1854-0607"]
["03-0301-1920","05-1274-0540","02-1854-0608"]
["03-0309-2421","05-1287-1703","02-1871-0147"]
["03-0310-2421","05-1297-1292","02-1887-1227"]
["03-0318-2421","05-1361-0011","02-1887-3035"]
["03-0320-0605","05-1384-0801","02-1899-0205"]
["03-0321-0641","05-1384-0802","02-1900-0205"]
["03-0321-0685","05-1387-2104","02-1906-0929"]
["03-0321-0703","05-1455-2105","02-1926-0306"]
["03-0321-0735","05-1472-1651","02-1926-0307"]
["03-0322-0810","05-1551-1506","02-1944-1930"]
["03-0322-0866","05-1566-0508","02-1945-1930"]
["03-0322-0880","05-1569-0488","02-1946-1930"]
["03-0322-0911","05-1569-0489","02-1948-0305"]
["03-0322-0925","05-1570-0547","02-1949-0305"]
["03-0322-0965","05-1588-1905","02-1950-0305"]
["03-0322-1011","05-1653-1405","02-1982-1831"]
["03-0322-1026","05-1655-1404","02-1987-0723"]
["03-0323-1064","05-1659-1905","02-2010-1776"]
["03-0323-1098","05-1665-1606","02-2011-1630"]
["03-0323-1165","05-1666-1606","02-2026-1330"]
["03-0323-1215","05-1667-1556","02-2026-1331"]
["03-0323-1520","05-1668-1556","02-2144-3013"]
["03-0332-1519","05-1669-0685","02-2144-3014"]
["03-0347-1920","05-1675-0695","02-2144-3034"]
["03-0348-0002","05-1675-1606","02-2144-3035"]
["03-0353-2421","05-1684-0200","02-2145-1729"]
["03-0362-1519","05-1684-0201","02-2150-1529"]
["03-0372-0002","05-1684-0202","02-2153-2228"]
["03-0375-0602","05-1694-1606","02-2153-2229"]
["03-0375-2822","05-1698-0501","02-2219-1328"]
["03-0392-2421","05-1759-0152","02-2220-1328"]
["03-0401-1520","05-1759-0153","02-2224-0720"]
["03-0412-2421","05-1766-0835","02-2226-0720"]
["03-0414-2421","05-1766-0836","02-2235-0720"]
["03-0419-0003","05-1766-0936","02-2236-0720"]
["03-0427-2822","05-1769-0590","02-2252-1627"]
["03-0459-2421","05-1799-0900","02-2252-1628"]
["03-0460-0003","05-1870-1468","02-2254-1628"]
["03-0461-1519","05-1923-0700","02-2275-1927"]
["03-0462-2822","05-1958-0243","02-2296-1727"]
["03-0479-1920","05-1966-0754","02-2301-2027"]
["03-0486-0603","05-1966-0755","02-2301-2028"]
["03-0496-1520","05-1968-0393","02-2306-1003"]
["03-0520-0604","05-1983-1505","02-2310-1874"]
["03-0521-0705","05-1983-1506","02-2389-1926"]
["03-0521-0735","05-1984-1505","02-2390-1926"]
["03-0521-0814","05-2056-1404","02-2407-1562"]
["03-0521-0848","05-2057-0191","02-2407-1563"]
["03-0521-0881","05-2057-0192","02-2408-1823"]
["03-0522-0922","05-2068-0813","02-2408-1824"]
["03-0522-0948","05-2069-1369","02-2413-2288"]
["03-0522-0959","05-2071-0875","02-2414-2288"]
["03-0522-0970","05-2139-0900","03-0000-0000"]
["03-0522-0981","05-2162-0398","03-0098-0209"]
["03-0522-1018","05-2162-0560","03-0103-2320"]
["03-0522-1040","05-2179-0299","03-0126-2730"]
["03-0522-1065","05-2180-0300","03-0128-2421"]
["03-0523-1099","05-2184-1705","03-0196-0002"]
["03-0523-1118","05-2185-1705","03-0198-0401"]
["03-0523-1133","05-2185-1706","03-0206-2120"]
["03-0523-1136","05-2202-0372","03-0224-1704"]
["03-0523-1158","05-2213-0700","03-0227-2163"]
["03-0523-1166","05-2361-0862","03-0227-2237"]
["03-0523-1198","05-2362-0862","03-0246-1720"]
["03-0523-1211","05-2365-1038","03-0284-2321"]
["03-0525-2021","05-2365-1039","03-0325-2975"]
["03-0525-2023","05-2365-1040","03-0335-0302"]
["03-0526-0003","05-2365-1041","03-0397-0481"]
["03-0526-2093","05-2371-1858","03-0460-3022"]
["03-0526-2140","05-2374-0999","03-0522-1018"]
["03-0526-2206","05-2376-0999","03-0525-2021"]
["03-0526-2266","05-2376-1000","03-0526-2926"]
["03-0527-2379","05-2471-1771","03-0527-2487"]
["03-0527-2421","05-2471-1855","03-0527-2895"]
["03-0530-1520","05-2489-1978","03-0545-2922"]
["03-0545-2221","05-2551-0310","03-0584-2922"]
["03-0553-1920","05-2551-0312","03-0595-0005"]
["03-0554-1920","05-2572-1868","03-0596-0058"]
["03-0570-1520","05-2572-1884","03-0596-0090"]
["03-0581-1920","05-2572-1911","03-0596-0117"]
["03-0587-0004","05-2600-1902","03-0596-0188"]
["03-0588-2422","05-2600-1903","03-0596-0199"]
["03-0592-1920","05-2600-1904","03-0596-0243"]
["03-0595-0005","05-2655-1403","03-0597-0286"]
["03-0596-0335","05-2667-1413","03-0627-2721"]
["03-0597-0315","05-2668-1479","03-0627-2722"]
["03-0597-0381","09-0336-0635","03-0764-0818"]
["03-0597-0476","09-0337-0636","03-0794-0305"]
["03-0597-0509","09-0337-0637","03-0829-1019"]
["03-0597-0543","09-0337-0638","03-0959-1620"]
["03-0597-0603","09-0385-0154","03-1009-1720"]
["03-0603-0304","09-0385-0155","03-1023-1820"]
["03-0603-2822","09-0773-0430","03-1057-1220"]
["03-0604-1520","09-0840-0439","03-1058-2022"]
["03-0617-2221","09-0840-0440","03-1073-1220"]
["03-0618-2221","09-1000-0924","03-1083-1220"]
["03-0622-2221","09-1001-0924","03-1101-2922"]
["03-0626-2822","09-1027-0046","03-1113-1219"]
["03-0627-2480","09-1084-0124","03-1120-1268"]
["03-0627-2606","09-1213-0555","03-1120-1328"]
["03-0627-2657","09-1246-0771","03-1121-1377"]
["03-0627-2670","09-1878-1491","03-1121-1411"]
["03-0627-2707","09-2073-0628","03-1126-2498"]
["03-0627-2721","09-2605-1612","03-1192-0008"]
["03-0627-2722","09-2630-1649","03-1303-1922"]
["03-0627-2832","09-2631-1626","03-1327-2635"]
["03-0627-2853","09-2631-1649","03-1393-0308"]
["03-0627-2910","09-2920-0513","03-1394-0308"]
["03-0627-2965","09-2924-0213","03-1422-1520"]
["03-0635-1519","09-2924-0214","03-1619-0919"]
["03-0636-3021","09-2924-0215","03-1722-1364"]
["03-0637-0604","09-2924-0216","03-1823-1421"]
["03-0637-1920","10-0125-3934","03-1890-0314"]
["03-0650-2221","10-0205-1959","03-1921-1118"]
["03-0655-1519","10-0221-4355","03-1940-3022"]
["03-0674-0604","10-0251-4380","03-1969-2922"]
["03-0683-0304","10-0295-0934","03-2001-1319"]
["03-0685-1519","10-0296-0934","03-2034-2923"]
["03-0685-2421","10-0306-0767","03-2062-1419"]
["03-0708-2722","10-0307-0766","03-2122-1620"]
["03-0717-1519","10-0501-1502","03-2126-1659"]
["03-0720-1246","10-0502-1501","03-2131-2422"]
["03-0722-1306","10-0502-1502","03-2183-1720"]
["03-0722-1318","10-0621-0804","03-2190-0406"]
["03-0722-1331","10-0772-4078","03-2221-0718"]
["03-0722-1416","10-0809-3288","03-2266-1720"]
["03-0723-1411","10-0825-3887","03-2326-1520"]
["03-0725-2221","10-0825-3888","03-2333-2595"]
["03-0729-0605","10-0869-2710","03-2528-2563"]
["03-0743-2421","10-0884-4005","03-2628-2542"]
["03-0745-2221","10-0965-4005","03-2684-0136"]
["03-0755-1919","10-0984-2708","03-2721-1079"]
["03-0760-1519","10-1131-3675","03-2723-1222"]
["03-0761-2221","10-1223-4007","03-2724-0113"]
["03-0761-2722","10-1223-4008","03-2733-2994"]
["03-0763-0605","10-1223-4064","03-2818-0717"]
["03-0775-2421","10-1236-2316","03-2819-0779"]
["03-0778-2221","10-1236-2317","03-2918-0738"]
["03-0782-2722","10-1317-3645","03-2919-1147"]
["03-0788-1920","10-1363-3681","03-2924-0215"]
["03-0792-0304","10-1385-3680","03-2928-2729"]
["03-0794-0305","10-1392-1026","03-2957-1524"]
["03-0802-2221","10-1392-1027","03-3023-1424"]
["03-0809-1920","10-1392-1153","03-3024-1524"]
["03-0819-1519","10-1392-1154","03-3119-1370"]
["03-0820-2722","10-1392-1249","03-3128-2916"]
["03-0835-1920","10-1393-1249","03-3221-1929"]
["03-0839-0005","10-1393-1302","03-3226-2750"]
["03-0840-1519","10-1393-1303","03-3226-2830"]
["03-0852-2422","10-1393-1304","03-3227-2830"]
["03-0864-2722","10-1393-1552","03-3228-3002"]
["03-0889-1920","10-1393-1553","03-3278-1529"]
["03-0892-2421","10-1393-1563","03-3383-0256"]
["03-0892-2722","10-1393-1564","03-3383-0308"]
["03-0912-2421","10-1393-1815","03-3410-3033"]
["03-0919-1520","10-1403-0887","03-3417-1011"]
["03-0936-0606","10-1403-0888","03-3418-1123"]
["03-0952-2723","10-1403-0889","03-3419-1230"]
["03-0964-2221","10-1403-0890","03-3421-2246"]
["03-0967-0006","10-1417-3682","03-3424-2232"]
["03-0970-2422","10-1487-3731","03-3445-0730"]
["03-0983-1520","10-1641-3764","03-3483-2033"]
["03-0990-2422","10-1924-3309","03-3493-3034"]
["03-0991-2221","10-2012-3983","03-3520-1979"]
["03-0994-0305","10-2012-3991","03-3521-2030"]
["03-0998-0606","10-2012-3992","03-3525-2934"]
["03-0999-0606","10-2013-3984","03-3526-2935"]
["03-1004-2723","10-2032-0184","03-3530-3035"]
["03-1008-1519","10-2050-0161","03-3549-1934"]
["03-1015-0606","10-2072-2909","03-3589-1633"]
["03-1021-0306","10-2104-2930","03-3610-1933"]
["03-1021-2221","10-2105-2979","03-3615-0728"]
["03-1028-2221","10-2106-3210","03-3618-1485"]
["03-1028-2674","10-2120-2909","03-3632-1132"]
["03-1029-2422","10-2120-2910","03-3658-0319"]
["03-1034-1519","10-2150-0102","03-3679-1433"]
["03-1040-2221","10-2150-0103","03-3682-0295"]
["03-1042-1020","10-2204-2963","03-3707-1133"]
["03-1059-0607","10-2206-3266","03-3707-1232"]
["03-1072-0306","10-2207-3426","03-3715-2036"]
["03-1080-0607","10-2207-3427","03-3723-0319"]
["03-1081-2221","10-2235-4008","03-3784-2335"]
["03-1091-2422","10-2239-3411","03-3802-0834"]
["03-1095-1020","10-2241-3674","03-3808-1234"]
["03-1115-0607","10-2244-3662","03-3820-0119"]
["03-1117-0638","10-2306-3337","03-3873-2636"]
["03-1119-0849","10-2312-4163","03-3883-0519"]
["03-1120-1029","10-2355-0102","03-3915-2134"]
["03-1120-1120","10-2371-3810","03-3916-2234"]
["03-1127-1020","10-2407-3456","03-3918-2600"]
["03-1127-1219","10-2487-0102","03-3923-1935"]
["03-1137-2623","10-2505-3307","03-3938-2535"]
["03-1153-1520","10-2505-3850","03-3954-0419"]
["03-1153-2221","10-2518-0102","03-3962-2035"]
["03-1157-1922","10-2518-0103","03-3964-2035"]
["03-1164-0307","10-2578-0102","03-3973-1735"]
["03-1166-1219","10-2705-3477","03-3976-1635"]
["03-1173-0607","10-2705-3485","03-3981-0350"]
["03-1188-2623","10-2790-3210","03-4001-0319"]
["03-1188-2624","10-2806-3598","03-4001-0811"]
["03-1192-0008","10-2816-3611","03-4005-1170"]
["03-1193-0094","10-2827-3211","03-4008-1401"]
["03-1193-0117","10-2827-3212","03-4012-1134"]
["03-1193-0132","10-2891-3311","03-4024-1035"]
["03-1193-0185","10-2903-3693","03-4029-1635"]
["03-1194-0308","10-2904-3331","03-4034-0935"]
["03-1195-0548","10-2906-4150","03-4039-2334"]
["03-1195-0575","10-2972-2910","03-4079-0260"]
["03-1202-2623","10-3002-3060","03-4083-0559"]
["03-1203-2422","10-3004-3369","03-4115-2281"]
["03-1214-0307","10-3073-0070","03-4132-2633"]
["03-1217-0608","10-3073-0162","03-4168-2035"]
["03-1220-1263","10-3074-0162","03-4170-0420"]
["03-1221-1399","10-3074-0163","03-4210-1935"]
["03-1221-1413","10-3136-4205","03-4210-1936"]
["03-1221-1442","10-3150-4097","05-0298-0801"]
["03-1222-1520","10-3168-0557","05-0298-0802"]
["03-1225-2622","10-3168-0558","06-0102-1881"]
["03-1237-2321","10-3173-3110","06-0102-1882"]
["03-1239-2722","10-3180-0856","06-0102-1883"]
["03-1241-1020","10-3180-0857","06-0102-1884"]
["03-1245-2221","10-3196-0202","06-0106-0998"]
["03-1249-2422","10-3196-0203","06-0107-0755"]
["03-1258-1521","10-3204-3328","06-0171-0705"]
["03-1260-1219","10-3204-3394","06-0206-0505"]
["03-1264-2221","10-3204-3395","06-0206-1027"]
["03-1267-0308","10-3244-0202","06-0254-0605"]
["03-1269-2422","10-3244-0203","06-0301-1355"]
["03-1285-1521","10-3244-0204","06-0301-1356"]
["03-1287-2421","10-3300-4113","06-0302-1355"]
["03-1288-1019","10-3300-4114","06-0304-0481"]
["03-1302-0308","10-3304-3376","06-0305-0566"]
["03-1309-0608","10-3316-3511","06-0305-0659"]
["03-1309-2322","10-3402-3202","06-0306-1151"]
["03-1314-1219","10-3441-2912","06-0325-0505"]
["03-1315-1521","10-3473-3411","06-0344-0706"]
["03-1323-2334","10-3482-3611","06-0361-1806"]
["03-1331-2722","10-3501-4118","06-0404-0594"]
["03-1333-2422","10-3503-3439","06-0404-0611"]
["03-1334-2221","10-3549-3512","06-0404-0612"]
["03-1338-0608","10-3601-3177","06-0405-1324"]
["03-1341-1219","10-3602-3348","06-0448-2132"]
["03-1346-2221","10-3680-4205","06-0500-1827"]
["03-1349-0308","10-3797-1833","06-0500-1828"]
["03-1352-2722","10-3851-1800","06-0526-1804"]
["03-1354-2372","10-3851-1801","06-0526-1805"]
["03-1370-2722","10-3933-1624","06-0534-2206"]
["03-1374-2422","10-3933-1625","06-0558-0707"]
["03-1377-1521","10-4014-1074","06-0559-0707"]
["03-1391-2222","10-4014-1075","06-0601-1752"]
["03-1393-0308","10-4031-1162","06-0601-1753"]
["03-1394-0308","10-4287-3936","06-0601-1754"]
["03-1397-2422","10-4287-3937","06-0602-1752"]
["03-1411-1220","10-4292-3390","06-0605-1346"]
["03-1412-0608","10-4300-2314","06-0605-1486"]
["03-1412-2222","10-4300-2315","06-0606-1345"]
["03-1413-1520","10-4300-2316","06-0653-1306"]
["03-1419-2722","10-4621-3203","06-0654-1307"]
["03-1420-2222","10-4831-3015","06-0695-1721"]
["03-1420-2223","10-5229-2692","06-0695-1722"]
["03-1420-2224","11-0317-0001","06-0695-1723"]
["03-1422-1520","11-0583-0393","06-0695-1724"]
["03-1424-1220","11-0936-2412","06-0695-1809"]
["03-1425-2398","11-1050-1011","06-0697-1604"]
["03-1427-2222","11-1076-2412","06-0702-0509"]
["03-1436-0308","11-1077-0952","06-0702-0510"]
["03-1439-1220","11-1077-0977","06-0721-0904"]
["03-1443-2421","11-1082-1212","06-0723-1306"]
["03-1446-0608","11-1084-2212","06-0723-1307"]
["03-1450-1520","11-1135-0512","06-0748-1607"]
["03-1472-0609","11-1139-1212","06-0748-1608"]
["03-1477-2722","11-1181-2251","06-0749-1606"]
["03-1490-0093","11-1181-2371","06-0770-2300"]
["03-1492-0205","11-1225-1013","06-0771-2301"]
["03-1492-0214","11-1372-0070","06-0787-1707"]
["03-1492-0360","11-1373-0212","06-0788-1706"]
["03-1492-0431","11-1373-0213","06-0788-1707"]
["03-1492-0483","11-1373-0214","06-0788-1708"]
["03-1492-0498","11-1451-2213","06-0793-1333"]
["03-1493-0309","11-1481-2368","06-0793-1334"]
["03-1493-0546","11-1529-1513","06-0793-1335"]
["03-1494-0598","11-1669-0407","06-0794-1687"]
["03-1494-0599","11-1669-0408","06-0795-1687"]
["03-1494-0602","11-1676-1507","06-0795-1688"]
["03-1513-1020","11-1678-1816","06-0795-1689"]
["03-1514-1520","11-1843-0114","06-0795-2038"]
["03-1515-2722","11-1858-1314","06-0796-1242"]
["03-1533-2722","11-1972-0918","06-0799-0598"]
["03-1544-1520","11-1972-0919","06-0799-0599"]
["03-1558-1220","11-2021-1315","06-0800-1606"]
["03-1570-1020","11-2073-1715","06-0800-1607"]
["03-1577-0609","11-2177-2416","06-0808-0610"]
["03-1581-1220","11-2179-2416","06-0809-0610"]
["03-1581-2221","11-2681-2339","06-0855-0409"]
["03-1609-1020","11-2681-2353","06-0855-0410"]
["03-1611-0309","11-2969-0507","06-0856-0409"]
["03-1617-1220","11-3164-0204","06-0890-0015"]
["03-1617-1221","11-3173-0456","06-0890-0165"]
["03-1619-2421","11-3349-2420","06-0890-0166"]
["03-1628-2429","11-3430-0019","06-0893-0318"]
["03-1630-2644","11-3430-0020","06-0893-0319"]
["03-1630-2692","11-3456-0019","06-0895-1350"]
["03-1630-2722","12-1245-0580","06-0895-1351"]
["03-1631-2771","12-1798-0693","06-0896-1561"]
["03-1631-2804","12-2552-0498","06-0896-1671"]
["03-1632-2889","12-2561-0300","06-0896-1672"]
["03-1632-2999","12-2632-0495","06-0896-2187"]
["03-1633-2932","12-2633-0495","06-0896-2199"]
["03-1647-2722","12-2730-0099","06-0896-2224"]
["03-1659-2421","12-2730-0100","06-0899-0760"]
["03-1660-1020","12-2907-0398","06-0899-0761"]
["03-1662-1521","12-6101-3183","06-0900-2204"]
["03-1679-2421","12-6101-3184","06-0965-0607"]
["03-1681-0310","12-6143-2587","06-0991-1002"]
["03-1694-2722","16-0639-0771","06-0991-1003"]
["03-1713-2421","16-1100-1271","06-0992-1003"]
["03-1720-0961","16-2215-2552","06-0994-2105"]
["03-1741-0920","16-3332-0210","06-0995-2104"]
["03-1745-1220","16-3332-0211","06-0995-2105"]
["03-1745-1221","16-3332-0212","06-1009-1002"]
["03-1751-2421","16-3332-0213","06-1009-1003"]
["03-1756-1521","16-3332-0214","06-1010-1002"]
["03-1763-0920","16-5873-0573","06-1011-1003"]
["03-1773-2722","16-6225-0719","06-1027-2106"]
["03-1778-2221","16-6618-0972","06-1032-0902"]
["03-1789-0011","16-6762-0973","06-1032-0903"]
["03-1790-0092","16-7140-0531","06-1032-0904"]
["03-1790-0114","16-7169-0528","06-1033-0902"]
["03-1790-0176","16-7275-0517","06-1037-1404"]
["03-1791-0261","16-7365-2163","06-1040-0903"]
["03-1791-0290","16-7463-2194","06-1041-0902"]
["03-1791-0311","17-1651-1864","06-1041-0903"]
["03-1791-0386","17-1652-1864","06-1077-1404"]
["03-1792-0445","17-2008-0389","06-1077-1405"]
["03-1792-0469","17-2400-0624","06-1077-1406"]
["03-1792-0491","17-2400-0625","06-1088-1862"]
["03-1792-0512","17-2461-0464","06-1090-1932"]
["03-1793-0590","17-2461-0465","06-1090-1933"]
["03-1797-0606","17-2575-0579","06-1090-1934"]
["03-1805-0610","17-2575-0580","06-1091-0026"]
["03-1809-0310","17-2693-1679","06-1093-1444"]
["03-1819-0646","17-2720-0805","06-1093-1445"]
["03-1819-0920","17-2720-0806","06-1093-1446"]
["03-1820-0770","17-2721-0843","06-1093-2106"]
["03-1821-0879","17-2722-0843","06-1094-1572"]
["03-1821-0913","17-2739-0950","06-1095-2186"]
["03-1821-0963","17-2739-0951","06-1127-0605"]
["03-1821-0988","17-3291-0186","06-1127-0606"]
["03-1822-1178","17-3567-0080","06-1127-0607"]
["03-1822-1251","17-3625-0190","06-1143-2104"]
["03-1822-1268","17-3774-2513","06-1143-2105"]
["03-1822-1281","17-3917-0137","06-1148-1405"]
["03-1823-1305","17-3953-2121","06-1148-1406"]
["03-1823-1349","17-3953-2122","06-1148-1407"]
["03-1823-1412","17-4199-0518","06-1148-1408"]
["03-1823-1421","17-4459-0547","06-1148-1409"]
["03-1823-1520","17-4459-1315","06-1149-1404"]
["03-1823-1521","17-4705-1410","06-1149-1405"]
["03-1823-1541","17-4757-1468","06-1149-1406"]
["03-1824-1582","17-4836-1419","06-1160-0505"]
["03-1824-1598","17-4947-1390","06-1161-0505"]
["03-1824-1655","21-1087-0002","06-1186-0605"]
["03-1824-1688","21-1112-3312","06-1186-0606"]
["03-1824-1738","21-1112-3313","06-1193-2000"]
["03-1824-1757","21-1127-0002","06-1193-2001"]
["03-1825-1520","21-2893-1365","06-1193-2113"]
["03-1825-1842","21-3026-1402","06-1193-2114"]
["03-1825-1914","21-3056-1404","06-1193-2115"]
["03-1826-1951","21-4313-1009","06-1201-1203"]
["03-1826-2033","21-4314-1025","06-1202-1202"]
["03-1826-2060","21-4363-1094","06-1203-0304"]
["03-1827-2098","21-4363-1095","06-1203-1203"]
["03-1827-2112","24-0735-3157","06-1221-0404"]
["03-1827-2143","24-0891-1561","06-1221-0405"]
["03-1828-2211","24-1053-1883","06-1236-1604"]
["03-1828-2225","24-1074-1876","06-1236-1605"]
["03-1828-2288","24-1098-0677","06-1237-1604"]
["03-1829-2325","24-1147-0207","06-1237-1605"]
["03-1829-2371","24-1391-0678","06-1239-0303"]
["03-1829-2398","24-1403-1125","06-1239-0304"]
["03-1829-2418","24-1419-1133","06-1261-0000"]
["03-1829-2432","24-1641-0675","06-1261-0001"]
["03-1829-2443","24-1680-3010","06-1261-0002"]
["03-1830-2525","24-1735-0654","06-1261-0003"]
["03-1831-2580","24-1738-0616","06-1270-2305"]
["03-1831-2648","24-1743-0580","06-1270-2306"]
["03-1831-2688","24-1799-2457","06-1285-1561"]
["03-1831-2722","24-3239-0590","06-1285-1589"]
["03-1832-2421","24-3241-0599","06-1285-1590"]
["03-1832-2758","24-3242-0689","06-1286-1560"]
["03-1832-2771","24-3568-3302","06-1286-1561"]
["03-1833-2814","24-3570-2486","06-1286-1590"]
["03-1833-2829","24-3571-2652","06-1288-1875"]
["03-1833-2888","24-3572-2685","06-1289-1875"]
["03-1833-2900","24-3578-0742","06-1289-1946"]
["03-1835-1220","24-3765-2250","06-1289-1947"]
["03-1835-1520","24-3769-2593","06-1290-0630"]
["03-1842-1520","24-3769-2594","06-1294-0202"]
["03-1847-0610","24-3770-2713","06-1301-1203"]
["03-1855-2221","24-3771-2879","06-1301-1204"]
["03-1858-1220","24-3804-2212","06-1301-1205"]
["03-1871-1519","24-3858-2212","06-1302-1203"]
["03-1872-2421","24-3869-2714","06-1302-1204"]
["03-1882-0310","24-4155-2112","06-1302-1205"]
["03-1883-1520","24-4182-2114","06-1302-1206"]
["03-1884-0310","24-5064-2595","06-1302-1207"]
["03-1885-1220","24-5065-2752","06-1310-1402"]
["03-1918-0610","24-5126-2961","06-1310-1403"]
["03-1921-2421","25-0402-1663","06-1310-1404"]
["03-1921-2822","25-1893-1020","06-1310-1405"]
["03-1939-2822","25-1991-0638","06-1311-1403"]
["03-1940-2221","25-2091-0718","06-1311-1404"]
["03-1949-0310","27-0023-1786","06-1311-1405"]
["03-1970-0610","27-0077-1986","06-1311-1406"]
["03-1975-1519","27-0169-2086","06-1311-1407"]
["03-1982-2220","27-0202-2535","06-1318-1003"]
["03-1990-1519","27-0202-2536","06-1322-1604"]
["03-1990-2421","27-0202-2584","06-1323-1604"]
["03-2002-1220","27-0252-2686","06-1339-1705"]
["03-2010-2421","27-0399-2081","06-1340-1704"]
["03-2010-2822","27-0401-2245","06-1340-1705"]
["03-2027-1883","27-0401-2440","06-1340-1706"]
["03-2027-1922","27-0402-2984","06-1341-1705"]
["03-2027-1923","27-0402-3244","06-1349-1704"]
["03-2027-2003","27-0409-1985","06-1350-1704"]
["03-2028-2107","27-0475-3087","06-1350-1705"]
["03-2028-2184","27-0576-2186","06-1350-1706"]
["03-2028-2220","27-0599-1917","06-1357-1004"]
["03-2029-2262","27-0599-1918","06-1357-1005"]
["03-2029-2263","27-0599-1919","06-1370-1402"]
["03-2029-2304","27-0599-1920","06-1370-1403"]
["03-2030-2360","27-0599-1938","06-1370-1404"]
["03-2030-2385","27-0599-1939","06-1389-0401"]
["03-2030-2445","27-0599-1978","06-1389-1210"]
["03-2030-2446","27-0600-2961","06-1389-1211"]
["03-2030-2477","27-0632-1187","06-1390-1210"]
["03-2031-2552","27-0697-1427","06-1390-1211"]
["03-2031-2585","27-0697-1628","06-1390-1212"]
["03-2031-2617","27-0699-2109","06-1390-1213"]
["03-2032-2724","27-0700-2265","06-1390-1214"]
["03-2032-2769","27-0700-2266","06-1391-0275"]
["03-2033-2804","27-0703-2285","06-1391-2031"]
["03-2033-2851","27-0777-3286","06-1391-2032"]
["03-2033-2864","27-0828-2186","06-1391-2033"]
["03-2033-2886","27-0871-2186","06-1392-2079"]
["03-2033-2893","27-0898-2124","06-1392-2080"]
["03-2033-2921","27-0899-2183","06-1392-2081"]
["03-2034-2923","27-0995-1619","06-1395-1204"]
["03-2034-3002","27-0996-1556","06-1395-1205"]
["03-2042-1519","27-0996-1618","06-1395-1206"]
["03-2049-2822","27-0998-2121","06-1395-1207"]
["03-2066-2421","27-1001-3219","06-1395-1208"]
["03-2066-2822","27-1097-1950","06-1396-1204"]
["03-2076-2220","27-1153-3285","06-1397-1704"]
["03-2084-1519","27-1184-3085","06-1397-1705"]
["03-2084-1520","27-1217-2286","06-1398-1704"]
["03-2095-2421","27-1228-1986","06-1398-1705"]
["03-2099-0611","27-1251-3285","06-1399-1703"]
["03-2101-0310","27-1252-2285","06-1403-0302"]
["03-2102-2822","27-1301-3178","06-1429-1604"]
["03-2113-2822","27-1301-3221","06-1432-2103"]
["03-2120-2221","27-1442-2685","06-1432-2104"]
["03-2130-2421","27-1496-2391","06-1446-2104"]
["03-2131-2422","27-1633-3085","06-1446-2105"]
["03-2132-0311","27-1690-1246","06-1446-2106"]
["03-2137-1220","27-1710-1385","06-1447-2104"]
["03-2139-0611","27-1787-0598","06-1447-2105"]
["03-2150-2823","27-1788-0597","06-1455-1904"]
["03-2156-2422","27-1788-0598","06-1455-1905"]
["03-2166-0311","27-1897-3429","06-1456-1903"]
["03-2166-2221","27-1908-1389","06-1456-1904"]
["03-2171-1519","27-1914-3409","06-1456-1905"]
["03-2176-1220","27-1938-2785","06-1457-1903"]
["03-2185-2421","27-1960-3408","06-1475-0001"]
["03-2221-0612","27-2000-2984","06-1488-1878"]
["03-2221-0642","27-2325-1665","06-1488-1879"]
["03-2221-0691","27-2393-3110","06-1491-1404"]
["03-2221-0692","27-2410-1719","06-1491-1405"]
["03-2221-0718","27-2740-1993","06-1491-1406"]
["03-2221-0816","27-2740-1994","06-1493-2204"]
["03-2221-0931","27-3112-2068","06-1493-2205"]
["03-2221-0942","27-3113-2576","06-1496-0605"]
["03-2221-0985","27-3117-2061","06-1496-0606"]
["03-2221-1018","27-3151-2014","06-1535-2305"]
["03-2221-1020","27-3183-2030","06-1535-2306"]
["03-2222-1070","27-4595-3285","06-1536-2305"]
["03-2222-1071","28-0229-3899","06-1536-2306"]
["03-2222-1082","28-0692-2922","06-1553-0403"]
["03-2222-1117","28-1287-3797","06-1570-2241"]
["03-2222-1156","28-1458-2689","06-1570-2242"]
["03-2223-1273","28-1511-1890","06-1570-2243"]
["03-2223-1371","28-1925-2310","06-1570-2244"]
["03-2224-1371","28-1975-4816","06-1570-2245"]
["03-2224-1372","28-1976-4854","06-1570-2246"]
["03-2224-1445","28-1976-4855","06-1583-0605"]
["03-2224-1478","28-2026-4699","06-1583-0606"]
["03-2224-1511","28-2061-4199","06-1588-1317"]
["03-2225-1525","28-2082-3708","06-1588-1318"]
["03-2227-1766","28-2219-2574","06-1594-2206"]
["03-2227-1767","28-2762-3467","06-1666-2206"]
["03-2229-1519","28-3174-2375","06-1666-2207"]
["03-2233-1220","28-3347-4750","06-1666-2208"]
["03-2243-2822","28-3711-3600","06-1682-0605"]
["03-2258-2422","28-3729-3600","06-1789-0022"]
["03-2269-1519","28-3842-1196","06-1789-0023"]
["03-2274-2823","28-4494-3998","06-1789-0024"]
["03-2276-2422","32-0396-4058","06-1789-0025"]
["03-2284-1520","32-0398-4058","06-1789-0805"]
["03-2285-1220","32-0930-4265","06-1789-0945"]
["03-2286-2221","32-0940-4266","06-1789-0946"]
["03-2288-0313","32-1005-4277","06-1790-0022"]
["03-2289-2823","32-1006-4277","06-1792-2112"]
["03-2307-0611","32-1368-3563","06-1792-2113"]
["03-2326-1520","32-1426-4443","06-1875-0705"]
["03-2341-1220","32-1455-3063","06-1876-0705"]
["03-2348-0612","32-1456-3063","06-1886-0742"]
["03-2371-1520","32-1460-3063","06-1886-0962"]
["03-2371-2823","32-2198-4458","06-1886-0963"]
["03-2378-1220","32-2199-4458","06-1887-0599"]
["03-2386-0612","32-2881-2163","06-1887-0600"]
["03-2387-0312","32-4017-0843","06-1887-0601"]
["03-2398-1520","32-4393-4441","06-1887-0742"]
["03-2409-2422","32-4417-1034","06-1914-1905"]
["03-2414-2222","32-4417-1035","06-1914-1906"]
["03-2423-1220","32-4417-1115","06-1914-1907"]
["03-2424-0920","32-5281-1463","06-1914-1908"]
["03-2449-1220","33-0737-0105","06-1944-1905"]
["03-2461-0612","33-0737-0106","06-1944-1906"]
["03-2481-0920","33-0737-0107","06-1944-1907"]
["03-2497-2422","33-0737-0177","06-1944-1908"]
["03-2554-2422","33-0936-0127","06-1944-1909"]
["03-2570-0921","33-0936-0128","06-1954-0306"]
["03-2574-2022","33-0936-0129","06-1954-0307"]
["03-2595-0921","33-0937-0277","06-1963-1505"]
["03-2616-1221","33-0937-0278","06-1964-1505"]
["03-2621-0921","33-0937-0279","06-1964-1506"]
["03-2622-1221","33-0937-0280","06-1981-0707"]
["03-2643-2023","33-1334-0284","06-1981-0708"]
["03-2658-0613","33-1605-0949","06-1981-0709"]
["03-2677-2023","33-1605-0950","06-1982-0707"]
["03-2685-0434","33-1638-0889","06-1984-1460"]
["03-2685-0613","33-1638-0890","06-1984-1461"]
["03-2687-0420","33-1983-0949","06-1985-0069"]
["03-2687-0495","33-1999-1049","06-1985-0070"]
["03-2688-0568","33-2032-0955","06-1985-0071"]
["03-2689-0595","33-2032-0956","06-1985-0089"]
["03-2689-0610","33-2032-0957","06-1985-0195"]
["03-2698-2023","33-2050-0949","06-1985-0196"]
["03-2711-0546","33-2050-0950","06-1985-0269"]
["03-2712-0921","33-2519-0950","06-1985-0270"]
["03-2722-1222","33-2520-0950","06-1985-0356"]
["03-2723-1222","33-2561-1508","06-1985-0357"]
["03-2723-1300","33-2717-1149","06-1985-0358"]
["03-2723-1393","33-2826-0468","06-1986-0508"]
["03-2724-1569","33-2826-0470","06-1986-0509"]
["03-2724-1570","33-2826-0471","06-1986-0560"]
["03-2725-1628","33-2827-0538","06-1986-0561"]
["03-2725-1679","33-2827-0539","06-1986-0562"]
["03-2725-1711","33-2874-0318","06-1986-0563"]
["03-2743-0554","33-2874-0319","06-1986-0700"]
["03-2753-2424","33-2875-0318","06-1986-0701"]
["03-2767-0554","33-2875-0379","06-1989-1505"]
["03-2768-0553","33-2966-0200","06-1989-1506"]
["03-2768-1222","33-2984-0650","06-1990-1506"]
["03-2774-0389","33-3023-0258","06-1995-2197"]
["03-2778-2424","33-3023-0259","06-1995-2208"]
["03-2784-0032","33-3023-0271","06-2008-0000"]
["03-2786-0208","33-3023-0272","06-2009-0001"]
["03-2787-0361","33-3023-0273","06-2019-1905"]
["03-2819-0387","33-3023-0274","06-2019-1906"]
["03-2824-0530","33-3030-0973","06-2019-1907"]
["03-2843-0388","33-3134-1516","06-2030-2005"]
["03-2843-0922","33-3143-1450","06-2036-1406"]
["03-2849-2024","33-3237-1716","06-2036-1407"]
["03-2863-2425","33-3249-1750","06-2037-1406"]
["03-2879-0922","33-3532-1237","06-2062-1506"]
["03-2887-0489","33-3578-2750","06-2063-1506"]
["03-2888-0532","33-3816-0449","06-2084-0059"]
["03-2888-0537","33-3868-0449","06-2084-0138"]
["03-2889-0615","33-3927-0895","06-2084-0139"]
["03-2891-2024","33-3927-0896","06-2085-0330"]
["03-2912-2425","33-3946-0549","06-2085-0331"]
["03-2923-0415","33-4054-0449","06-2085-0332"]
["03-2925-2026","33-4055-2254","06-2085-0429"]
["03-2925-2090","33-4056-2254","06-2085-0430"]
["03-2925-2119","33-4077-0449","06-2085-0431"]
["03-2925-2193","33-4077-0450","06-2086-0510"]
["03-2925-2308","33-4077-0451","06-2086-0511"]
["03-2925-2351","33-4109-0951","06-2086-0512"]
["03-2925-2414","33-4110-0951","06-2086-0513"]
["03-2926-2486","33-4320-0305","06-2086-0667"]
["03-2926-2509","33-4320-0306","06-2087-0667"]
["03-2927-2572","33-4413-1252","06-2087-1093"]
["03-2927-2606","33-4414-1252","06-2087-1094"]
["03-2927-2624","33-4415-1252","06-2087-1095"]
["03-2928-2729","33-4415-1253","06-2087-1206"]
["03-2929-2809","33-4430-1229","06-2087-1207"]
["03-2929-2825","33-4430-1230","06-2091-2031"]
["03-2929-2864","33-4430-1304","06-2118-2005"]
["03-2930-2829","33-4430-1305","06-2121-1007"]
["03-2931-2963","33-4472-2105","06-2121-1008"]
["03-2931-3006","33-4472-2106","06-2121-1009"]
["03-2954-0615","33-4472-2107","06-2127-0306"]
["03-2957-0415","33-4472-2108","06-2127-0307"]
["03-2959-0923","33-4504-2055","06-2136-0406"]
["03-2959-2426","34-2387-0000","06-2136-0407"]
["03-2970-1224","35-0068-2662","06-2137-0407"]
["03-2974-2025","35-0068-2663","06-2137-0408"]
["03-2982-0923","35-0068-2664","06-2184-0050"]
["03-2983-0051","35-0068-2665","06-2184-0051"]
["03-2984-0171","35-0084-2414","06-2184-0128"]
["03-2984-0200","35-0085-2414","06-2185-0129"]
["03-2985-0241","35-0085-2415","06-2185-0278"]
["03-2985-0328","35-0160-2450","06-2185-0285"]
["03-2985-0363","35-0202-2862","06-2185-0286"]
["03-2986-0392","35-0254-2215","06-2185-0287"]
["03-2987-0500","35-0255-2215","06-2185-0491"]
["03-2987-0501","35-0274-2762","06-2185-1329"]
["03-2987-0524","35-0319-2962","06-2185-1342"]
["03-2988-0614","35-0384-2580","06-2186-0490"]
["03-2993-2426","35-0462-3363","06-2186-0627"]
["03-2994-2026","35-0463-3363","06-2186-0628"]
["03-3012-0924","35-0463-3364","06-2186-1246"]
["03-3017-0629","35-0559-2657","06-2187-1245"]
["03-3018-0689","35-0559-2658","06-2192-2005"]
["03-3018-0715","35-0559-2659","06-2192-2006"]
["03-3018-0744","35-0559-2660","06-2193-2005"]
["03-3019-0886","35-0560-3329","06-2195-2333"]
["03-3019-0920","35-0560-3330","06-2195-2334"]
["03-3019-0967","35-0560-3582","06-2195-2335"]
["03-3019-1006","35-0660-3280","06-2195-2336"]
["03-3020-1045","35-0661-4321","06-2196-2333"]
["03-3020-1083","35-0858-2738","06-2211-0607"]
["03-3021-1130","35-0858-2754","06-2211-0608"]
["03-3021-1167","35-0858-2755","06-2281-1407"]
["03-3022-1224","35-0859-3855","06-2281-1408"]
["03-3023-0615","35-0903-1382","06-2281-1409"]
["03-3023-1342","35-0949-0481","06-2281-1410"]
["03-3023-1368","35-0949-0482","06-2282-1407"]
["03-3023-1424","35-0957-2785","06-2284-0184"]
["03-3024-1455","35-0958-2778","06-2284-0185"]
["03-3024-1524","35-0958-2781","06-2284-0254"]
["03-3024-1526","35-1059-3263","06-2284-0255"]
["03-3024-1613","35-1080-2958","06-2285-0455"]
["03-3024-1642","35-1171-1919","06-2285-0456"]
["03-3024-1679","35-1199-1919","06-2285-1349"]
["03-3025-1779","35-1199-1920","06-2285-1429"]
["03-3025-1811","35-1199-1921","06-2285-1454"]
["03-3038-1225","35-1362-4510","06-2286-0577"]
["03-3055-0615","35-1442-4158","06-2286-0823"]
["03-3063-1225","35-1443-4158","06-2286-0824"]
["03-3065-2426","35-1486-0512","06-2286-0825"]
["03-3070-2027","35-1557-3707","06-2286-1350"]
["03-3114-2427","35-1557-3708","06-2286-1429"]
["03-3119-2028","35-1579-3654","06-2286-1453"]
["03-3121-0615","35-1590-1427","06-2286-1957"]
["03-3127-0215","35-1591-1802","06-2291-2084"]
["03-3141-2428","35-1591-1803","06-2295-2267"]
["03-3145-2829","35-1591-1804","06-2295-2268"]
["03-3155-2028","35-1591-1805","06-2295-2269"]
["03-3178-2829","35-1636-4357","06-2295-2270"]
["03-3182-0016","35-1636-4358","06-2295-2271"]
["03-3182-0085","35-1653-2887","06-2295-2272"]
["03-3183-0216","35-1653-2888","06-2386-0000"]
["03-3184-0270","35-1672-4027","06-2386-0001"]
["03-3184-0298","35-1673-4027","06-2394-2238"]
["03-3184-0311","35-1673-4028","06-2394-2269"]
["03-3185-0357","35-1782-4028","06-2394-2270"]
["03-3185-0365","35-1783-4028","06-2395-2237"]
["03-3185-0405","35-1783-4029","06-2395-2238"]
["03-3185-0422","35-1783-4030","06-2395-2239"]
["03-3186-0442","36-0635-0203","06-2395-2308"]
["03-3186-0457","36-0635-0204","06-2422-2207"]
["03-3187-0583","36-0725-0203","06-2442-2308"]
["03-3193-0216","36-0725-0204","06-2443-2307"]
["03-3204-2429","36-0780-0203","06-2454-0209"]
["03-3217-0625","36-0994-1117","06-2455-0208"]
["03-3217-0704","36-1361-3376","06-2470-0508"]
["03-3217-0722","36-1489-1076","06-2470-0509"]
["03-3218-0842","36-1515-0203","06-2470-0510"]
["03-3218-0910","36-1694-3208","06-2470-0511"]
["03-3218-0997","36-1779-0197","06-2472-0508"]
["03-3219-1054","36-1843-0701","06-2480-1353"]
["03-3219-1076","36-1979-0187","06-2480-1549"]
["03-3219-1106","36-2014-0175","06-2480-1550"]
["03-3219-1141","36-2076-0202","06-2481-1139"]
["03-3219-1188","36-2282-0213","06-2481-1549"]
["03-3222-1227","36-2282-0214","06-2481-1550"]
["03-3226-2830","36-2315-0201","06-2481-1719"]
["03-3227-2830","36-2448-0200","06-2482-0837"]
["03-3238-0216","36-2872-0261","06-2482-0838"]
["03-3238-2030","36-2872-0262","06-2482-0893"]
["03-3243-0616","36-2872-0263","06-2482-0894"]
["03-3243-1214","36-3072-2083","06-2482-1140"]
["03-3268-3031","36-3345-2278","06-2482-1718"]
["03-3269-3031","36-3345-2279","06-2482-1745"]
["03-3272-0216","36-3345-4090","06-2482-1746"]
["03-3277-0617","36-3415-2492","06-2483-0257"]
["03-3279-2030","36-3415-2493","06-2483-0258"]
["03-3295-0217","36-3505-1772","06-2483-0413"]
["03-3304-2831","36-3546-3686","06-2484-0257"]
["03-3313-0216","36-3568-0781","06-2484-0319"]
["03-3314-1228","36-3568-0782","06-2484-0320"]
["03-3315-0618","36-3569-0874","06-2484-0375"]
["03-3319-1235","36-4059-1509","06-2490-2249"]
["03-3319-1364","36-4275-3218","06-2491-2251"]
["03-3319-1403","36-4463-0996","06-2493-2351"]
["03-3319-1465","36-4557-0903","06-2493-2352"]
["03-3319-1493","36-4914-0699","06-2494-2352"]
["03-3319-1518","37-1781-0492","06-2496-1708"]
["03-3319-1581","37-1827-0192","06-2497-1008"]
["03-3319-1587","37-2157-0332","06-2497-1709"]
["03-3320-1639","37-2158-0371","06-2498-1008"]
["03-3320-1659","38-0574-1800","06-2498-1009"]
["03-3320-1725","38-1163-0891","06-2498-1709"]
["03-3320-1764","38-1236-0111","06-2500-1408"]
["03-3320-1891","38-1626-1500","06-2508-1708"]
["03-3320-1892","38-1776-1196","06-2517-0807"]
["03-3321-1567","38-1858-0456","06-2518-0808"]
["03-3321-1958","38-1876-0475","06-2519-0207"]
["03-3321-1999","38-1876-0482","06-2519-0208"]
["03-3321-2100","38-1876-2798","06-2532-2208"]
["03-3322-2202","38-2003-1200","06-2551-2207"]
["03-3323-2428","38-2197-1201","06-2552-2207"]
["03-3324-2488","38-2203-1400","06-2580-1247"]
["03-3324-2489","38-2335-1201","06-2580-1248"]
["03-3326-2851","38-2352-1400","06-2580-1476"]
["03-3327-2950","38-2867-0296","06-2580-2208"]
["03-3333-0630","38-3261-0043","06-2581-0017"]
["03-3352-0217","38-3263-0177","06-2581-1247"]
["03-3361-2932","38-3263-0264","06-2581-1476"]
["03-3373-1229","41-0266-0611","06-2581-1477"]
["03-3415-2933","41-0272-0669","06-2581-1478"]
["03-3416-1230","41-1358-1673","06-2581-1695"]
["03-3419-1230","41-1381-1807","06-2581-1696"]
["03-3431-2933","41-1411-2024","06-2581-1748"]
["03-3445-0217","41-1451-1608","06-2582-0017"]
["03-3445-0218","41-1534-0176","06-2582-0203"]
["03-3450-1230","41-1609-0599","06-2582-0204"]
["03-3459-2433","41-1659-1101","06-2582-0891"]
["03-3468-2934","41-1659-1102","06-2582-1748"]
["03-3469-0617","41-1712-0812","06-2582-1749"]
["03-3481-0037","41-1740-0815","06-2582-1750"]
["03-3481-0079","41-1805-0849","06-2583-0635"]
["03-3482-0189","41-1816-0853","06-2583-0769"]
["03-3483-0275","41-1860-2272","06-2583-1874"]
["03-3483-0353","41-1863-0853","06-2583-1875"]
["03-3484-0408","41-1918-0704","06-2584-0308"]
["03-3495-2934","41-2225-1457","06-2589-2197"]
["03-3515-0673","41-2270-2144","06-2589-2234"]
["03-3516-0732","41-2322-1454","06-2590-2197"]
["03-3516-0821","43-0477-3518","06-2590-2233"]
["03-3517-0939","43-0478-3517","06-2590-2234"]
["03-3517-0959","43-0498-0482","06-2592-0207"]
["03-3517-1030","43-0498-0483","06-2600-2207"]
["03-3517-1035","43-0498-0484","06-2622-2207"]
["03-3517-1090","43-0499-0481","06-2629-2307"]
["03-3517-1117","43-0528-0457","06-2629-2308"]
["03-3517-1130","43-0529-0457","06-2631-0001"]
["03-3517-1135","43-0534-3501","06-2663-0000"]
["03-3518-1194","43-0535-2985","06-2664-0001"]
["03-3518-1224","43-0535-2986","06-2664-0002"]
["03-3518-1296","43-0535-2987","06-2665-0001"]
["03-3518-1394","43-0538-2985","06-2680-1418"]
["03-3518-1401","43-0602-1900","06-2680-1419"]
["03-3519-1231","43-0602-1901","06-2680-1420"]
["03-3519-1512","43-0602-1902","06-2681-0027"]
["03-3519-1532","43-0668-0455","06-2681-0834"]
["03-3519-1584","43-0669-0455","06-2681-0835"]
["03-3519-1706","43-0735-1958","06-2681-0836"]
["03-3520-1533","43-0736-1958","06-2681-1420"]
["03-3520-1812","43-0805-1158","06-2681-1706"]
["03-3525-2934","43-0806-1158","06-2681-1707"]
["03-3526-2934","43-0843-1958","06-2682-0016"]
["03-3526-2935","43-0869-1359","06-2682-0017"]
["03-3546-2935","43-0870-1359","06-2682-0018"]
["03-3565-0618","43-0871-1359","06-2682-0019"]
["03-3572-2935","43-0933-2758","06-2682-0020"]
["03-3593-2935","43-0934-2758","06-2682-0027"]
["03-3600-0618","43-0935-2758","06-2682-1801"]
["03-3604-1533","43-0943-1158","06-2683-0001"]
["03-3620-2936","43-0944-1158","06-2684-0536"]
["03-3628-0618","43-0945-1158","06-2684-0537"]
["03-3629-1533","43-0965-2758","06-2687-1807"]
["03-3629-1534","43-0966-2758","06-2687-1808"]
["03-3629-1535","43-0996-2758","06-2703-0507"]
["03-3638-2936","43-0997-2758","06-2703-0508"]
["03-3639-1233","43-1039-2058","06-2704-0507"]
["03-3639-2435","43-1131-3041","06-2737-1807"]
["03-3672-0833","43-1131-3042","06-2742-1407"]
["03-3689-0618","43-1134-1858","06-2749-0207"]
["03-3703-0219","43-1135-1858","06-2749-1807"]
["03-3704-0833","43-1136-1858","06-2750-0207"]
["03-3714-1885","43-1137-1858","06-2817-1706"]
["03-3715-1930","43-1199-1607","06-2817-1707"]
["03-3715-1961","43-1199-1608","06-2817-1708"]
["03-3715-2033","43-1199-1609","06-2879-1140"]
["03-3715-2036","43-1199-1610","06-2879-1361"]
["03-3716-2109","43-1210-1658","06-2879-1362"]
["03-3717-2273","43-1211-1658","06-2880-0845"]
["03-3717-2431","43-1212-1658","06-2881-0800"]
["03-3718-1534","43-1213-1658","06-2882-0443"]
["03-3718-2519","43-1299-1830","06-2882-0444"]
["03-3718-2936","43-1299-1831","06-2882-0445"]
["03-3719-2591","43-1299-1832","06-2882-0446"]
["03-3719-2656","43-1299-1833","06-2886-0808"]
["03-3719-2699","43-1300-1258","06-2886-0809"]
["03-3720-2784","43-1301-1258","06-2886-0810"]
["03-3720-2807","43-1345-0658","06-2886-0811"]
["03-3721-2854","43-1345-0659","06-2887-0206"]
["03-3721-2892","43-1390-3630","06-2887-0808"]
["03-3721-2936","43-1391-3630","06-2893-2406"]
["03-3721-2939","43-1392-3630","06-2899-1906"]
["03-3721-2942","43-1393-3630","06-2899-1907"]
["03-3722-2992","43-1394-0780","06-2979-1145"]
["03-3752-1534","43-1394-0781","06-2979-1146"]
["03-3753-0834","43-1429-2158","06-2979-1147"]
["03-3797-0619","43-1497-1522","06-2979-1148"]
["03-3801-1534","43-1497-1523","06-2979-1380"]
["03-3801-2936","43-1497-1524","06-2979-1381"]
["03-3802-0834","43-1546-2259","06-2979-1382"]
["03-3806-0834","43-1547-2259","06-2980-0157"]
["03-3808-1234","43-1548-2259","06-2980-1145"]
["03-3811-1534","43-1592-1662","06-2980-1689"]
["03-3815-2435","43-1593-1661","06-2980-2006"]
["03-3828-0834","43-1593-1662","06-2981-1688"]
["03-3842-1535","43-1594-3551","06-2981-1791"]
["03-3843-0619","43-1594-3552","06-2981-1792"]
["03-3846-2435","43-1594-3553","06-2981-1823"]
["03-3853-2935","43-1629-1758","06-2982-1824"]
["03-3856-0834","43-1632-1758","06-2994-0830"]
["03-3859-2435","43-1760-1758","06-3050-1806"]
["03-3873-1235","43-1761-1758","06-3051-1806"]
["03-3878-0037","43-1762-1758","06-3060-2404"]
["03-3879-0109","43-1763-1758","06-3061-2404"]
["03-3879-0126","43-1810-3258","06-3079-1345"]
["03-3879-0186","43-1814-2958","06-3079-1346"]
["03-3879-0219","43-1815-2958","06-3083-1929"]
["03-3880-0241","43-2086-2358","06-3111-2002"]
["03-3881-0349","43-2087-2358","06-3115-1806"]
["03-3882-0462","43-2353-2058","06-3116-1806"]
["03-3882-0834","43-2353-2059","06-3116-1807"]
["03-3883-0519","43-2395-1592","06-3136-1707"]
["03-3883-0573","43-2395-1593","06-3137-1706"]
["03-3884-0614","43-2453-1658","06-3151-0492"]
["03-3890-1535","43-2454-1658","06-3180-0350"]
["03-3903-1235","43-2476-2358","06-3180-0351"]
["03-3906-0834","43-2477-2358","06-3277-1220"]
["03-3913-1907","43-2533-1756","06-3277-1221"]
["03-3914-1954","43-2533-1757","06-3278-0983"]
["03-3914-2067","43-2591-1481","06-3279-0983"]
["03-3914-2107","43-2591-1482","06-3279-0984"]
["03-3915-2139","43-2695-1882","06-3279-1661"]
["03-3915-2165","43-2695-1883","06-3280-1660"]
["03-3915-2435","43-2746-1908","06-3280-1773"]
["03-3916-2234","43-2746-1909","06-3280-1774"]
["03-3916-2238","43-3079-1856","06-3285-2025"]
["03-3916-2352","43-3080-1856","06-3285-2026"]
["03-3916-2353","43-3183-1858","06-3288-2290"]
["03-3917-2431","43-3768-4159","06-3288-2291"]
["03-3918-2435","43-3818-3648","06-3289-2340"]
["03-3943-2935","43-3818-3649","06-3289-2341"]
["03-3946-1235","43-3823-4598","06-3290-2340"]
["03-3949-1535","43-3825-4801","07-0004-0222"]
["03-3975-0619","43-3825-4802","07-0004-0236"]
["03-3983-2435","43-3890-2124","07-0004-0237"]
["03-3993-2435","43-3890-2125","07-0004-0238"]
["03-3994-1535","43-3903-2808","07-0005-0072"]
["03-4008-1472","43-3969-2359","07-0005-0222"]
["03-4009-1538","43-4021-3456","07-0017-3100"]
["03-4010-0835","43-4384-2030","07-0018-3100"]
["03-4010-1657","43-4384-2031","07-0050-2101"]
["03-4010-1658","43-4385-2085","07-0101-2177"]
["03-4011-1722","43-4477-1861","07-0101-2178"]
["03-4011-1723","43-4478-1861","07-0150-1701"]
["03-4011-1737","43-4882-1949","07-0216-2774"]
["03-4011-1785","43-4882-1950","07-0302-3103"]
["03-4011-1786","43-4883-1980","07-0315-3192"]
["03-4014-0619","43-4883-1981","07-0316-3460"]
["03-4024-1435","43-4884-2063","07-0362-3204"]
["03-4035-2934","43-4884-2064","07-0366-4005"]
["03-4041-1236","43-4884-2065","07-0408-3605"]
["03-4042-1435","45-0170-0200","07-0415-3255"]
["03-4043-1435","45-0198-0442","07-0416-3649"]
["03-4051-0835","45-0198-0443","07-0416-3776"]
["03-4065-2435","45-0198-0444","07-0418-4096"]
["03-4068-2933","45-0198-0445","07-0430-2503"]
["03-4085-0620","45-0199-0445","07-0430-2504"]
["03-4090-0835","45-0399-0671","07-0431-2503"]
["03-4090-0836","45-0399-0672","07-0442-4105"]
["03-4112-2933","45-0399-0673","07-0442-4106"]
["03-4114-2435","45-0399-0886","07-0471-1102"]
["03-4135-0836","45-0441-0300","07-0516-3831"]
["03-4135-2933","45-0442-0701","07-0517-4227"]
["03-4140-0836","45-0443-0300","07-0518-4227"]
["03-4144-1435","45-0443-0701","07-0538-2104"]
["03-4157-2434","45-0445-0701","07-0575-4307"]
["03-4169-0620","45-0455-0200","07-0647-1004"]
["03-4171-2933","45-0456-0201","07-0649-1004"]
["03-4173-1236","45-0457-0201","07-0650-1004"]
["03-4178-0066","45-0465-0500","07-0664-4707"]
["03-4178-0102","45-0466-0500","07-0699-0579"]
["03-4179-0178","45-0467-0501","07-0713-4308"]
["03-4179-0222","45-0467-0502","07-0719-4405"]
["03-4180-0276","45-0648-0200","07-0720-4282"]
["03-4181-0335","45-0668-0201","07-0720-4283"]
["03-4181-0336","45-0894-0201","07-0726-3370"]
["03-4181-0402","45-0975-0101","07-0726-3371"]
["03-4182-0472","45-0975-0102","07-0742-0804"]
["03-4182-0519","45-1001-1967","07-0746-3709"]
["03-4182-0520","45-1195-0356","07-0749-3909"]
["03-4182-0536","45-1395-0362","07-0755-3609"]
["03-4192-2435","45-1429-0102","07-0784-4608"]
["03-4199-0698","45-1814-0101","07-0784-4609"]
["03-4199-0713","45-1989-0424","07-0785-4608"]
["03-4200-0752","45-2121-0104","07-0797-3809"]
["03-4200-0794","45-2189-0392","07-0799-3409"]
["03-4201-0831","45-2286-0125","07-0800-0504"]
["03-4201-0863","45-2323-1506","07-0800-0505"]
["03-4201-0899","45-2360-1507","07-0800-0719"]
["03-4202-0936","45-2368-1507","07-0801-0724"]
["03-4202-1018","45-2694-1504","07-0815-3441"]
["03-4203-1068","45-2999-2193","07-0849-0304"]
["03-4203-1104","45-3310-2409","07-0849-0305"]
["03-4204-1180","45-3364-1909","07-0874-4609"]
["03-4205-1235","45-3392-1476","07-0892-0104"]
["03-4205-1284","45-3392-1477","07-0893-0104"]
["03-4208-1583","45-3399-2255","07-0905-0204"]
["03-4209-1689","45-3399-2256","07-0914-0104"]
["03-4210-1815","45-3476-1909","07-0916-3520"]
["03-4210-2434","45-3491-1397","07-0916-3521"]
["05-0425-1602","45-3492-1451","07-0928-4111"]
["05-0483-1602","45-3493-1552","07-0928-4112"]
["05-0769-1213","45-3495-1795","07-1602-2223"]
["05-0770-1311","45-3496-1939","07-1702-1937"]
["05-0770-1484","45-3497-2050","07-1721-1914"]
["05-0770-1492","45-3538-1909","07-1782-2215"]
["05-0771-0221","45-3591-1438","07-1801-2115"]
["05-0771-0312","45-3699-1005","07-1802-2009"]
["05-0771-1703","45-3699-1027","07-1878-3617"]
["05-0771-1787","45-3699-1174","07-2175-0214"]
["05-0771-1794","45-3699-1176","07-2182-0214"]
["05-0790-0107","45-3699-1321","07-2183-0214"]
["05-0856-0801","45-3699-1441","07-2191-0169"]
["05-1004-2702","45-3699-1442","07-2191-0170"]
["05-1110-0803","45-3699-1574","07-2197-0515"]
["05-1165-0102","45-3699-1922","07-2211-2517"]
["05-1206-0402","45-3700-1321","07-2254-0714"]
["05-1229-0903","45-3700-1574","07-2254-0715"]
["05-1516-0400","45-3700-1631","07-2255-0714"]
["05-1517-0400","45-3700-1709","07-2262-0815"]
["05-1749-0800","45-3700-1784","07-2262-0816"]
["05-1750-0800","45-3700-1834","07-2375-4320"]
["05-1858-0199","45-3700-1835","07-2417-4320"]
["05-1865-0199","45-3700-1922","07-2464-2910"]
["05-1867-0682","45-3700-2114","07-2464-2911"]
["05-1874-0202","45-3701-1008","07-2464-2912"]
["05-1948-0401","45-3701-1009","07-2541-4321"]
["05-2027-0200","45-3701-1908","07-2703-3722"]
["05-2035-0801","45-3701-1909","07-2717-3746"]
["05-2052-0801","45-3789-2409","07-2720-4632"]
["05-2104-0200","45-3789-2410","07-2720-4633"]
["05-2105-0200","45-3815-1007","07-2720-4634"]
["05-2155-0188","45-3816-1007","07-2732-4622"]
["05-2156-0188","45-3825-1408","07-2732-4623"]
["05-2156-0189","45-3825-1409","07-2915-3435"]
["05-2156-0190","45-3852-1207","07-2915-3436"]
["05-2370-0901","45-3852-1208","07-2915-3437"]
["05-2568-0404","45-3858-1808","07-2915-3438"]
["06-1950-1807","45-3859-1808","07-2923-3424"]
["06-1950-1808","45-3898-1212","07-2924-3424"]
["06-1994-1808","45-3898-1412","07-2924-3425"]
["06-1994-1809","45-3898-1413","07-2924-3426"]
["06-1995-1808","45-3899-0856","07-2939-3624"]
["06-1995-1809","45-3899-0857","07-2939-3625"]
["06-1995-1810","45-3899-0858","07-2967-4424"]
["06-1995-1811","45-3899-1044","07-2967-4425"]
["08-0298-1723","45-3899-1045","07-2967-4426"]
["08-0787-1677","45-3899-1212","07-2967-4427"]
["08-0787-1728","45-3899-1763","07-2992-4623"]
["08-0812-0350","45-3899-1764","07-2992-4624"]
["08-1086-1700","45-3899-1879","07-2992-4625"]
["08-1086-1701","45-3899-1969","07-2999-3924"]
["08-1086-1836","45-3899-1970","07-3006-4024"]
["08-1086-2204","45-3900-1968","07-3026-4524"]
["08-1197-1613","45-3900-1969","07-3114-3454"]
["08-1207-0720","45-3900-2029","07-3114-3455"]
["08-1277-0977","45-3900-2030","07-3115-3707"]
["08-1277-0978","45-3900-2173","07-3119-4453"]
["08-1291-2297","45-3900-2174","07-3119-4540"]
["08-1316-0720","45-3900-2175","07-3150-3624"]
["08-1364-1117","45-3998-1546","07-3151-3624"]
["08-1405-0215","45-3999-0758","07-3217-4202"]
["08-1405-0302","45-3999-0844","07-3217-4203"]
["08-1424-0901","45-3999-0907","07-3217-4204"]
["08-1425-0979","45-3999-0979","07-3219-4457"]
["08-1515-0721","45-3999-0989","07-3231-0716"]
["08-1522-0308","45-3999-0990","07-3243-0616"]
["08-1549-0918","45-3999-1549","07-3246-0916"]
["08-1587-1617","45-3999-1588","07-3311-3125"]
["08-1596-1915","45-3999-1589","07-3311-3126"]
["08-1596-1916","45-3999-1668","07-3311-3127"]
["08-1597-1915","45-3999-1669","07-3313-3123"]
["08-1597-1916","45-3999-1910","07-3313-3124"]
["08-1597-2990","45-4000-1909","07-3313-3332"]
["08-1632-0720","45-4000-1910","07-3314-3123"]
["08-1637-0917","45-4010-1107","07-3315-3624"]
["08-1683-1653","45-4056-1909","07-3319-3323"]
["08-1683-1749","45-4098-1909","07-3319-4415"]
["08-1702-0916","45-4119-1909","07-3349-3724"]
["08-1702-0917","45-4119-1910","07-3414-3497"]
["08-1739-2711","45-4120-1909","07-3414-3735"]
["08-1739-2712","45-4161-1708","07-3414-3736"]
["08-1742-0718","45-4161-1709","07-3415-3854"]
["08-1743-0718","45-4162-1708","07-3416-4196"]
["08-1775-0861","45-4203-0907","07-3416-4197"]
["08-1775-0862","45-4205-0908","07-3418-4375"]
["08-1777-0717","45-4206-0907","07-3418-4527"]
["08-1810-0106","45-4257-2310","07-3424-3725"]
["08-1811-0106","45-4257-2311","07-3424-3726"]
["08-1892-2661","45-4258-1309","07-3508-3924"]
["08-1892-2662","45-4258-2310","07-3511-3180"]
["08-1896-0038","45-4258-2311","07-3513-3442"]
["08-1896-0039","45-4273-1308","07-3517-4387"]
["08-1898-0215","45-4274-1308","07-3528-2821"]
["08-1899-0268","45-4312-1108","07-3528-2822"]
["08-1966-0716","45-4313-1108","07-3612-4024"]
["08-1979-1330","45-4313-1109","08-1009-0111"]
["08-2028-0916","45-4332-1310","08-1060-0210"]
["08-2097-0171","45-4333-1310","08-1078-0889"]
["08-2101-0291","45-4333-1311","08-1098-1712"]
["08-2101-0292","45-4333-1312","08-1181-1063"]
["08-2103-0509","45-4376-2111","08-1189-2231"]
["08-2188-2623","45-4389-1322","08-1227-1814"]
["08-2244-1314","45-4389-1323","08-1481-3009"]
["08-2332-1315","45-4389-1324","08-1589-2473"]
["08-2501-0284","45-4389-1325","08-2166-1215"]
["08-2501-0598","45-4389-1326","08-2471-1016"]
["08-2502-0598","45-4393-1680","08-2486-0716"]
["08-2646-1414","45-4495-1911","08-2572-0803"]
["08-2752-1414","45-4495-1912","08-2995-0028"]
["08-2830-0602","45-4495-1913","08-3280-2840"]
["08-2830-0603","45-4579-0912","09-2223-1817"]
["08-2899-0466","45-4580-0912","09-2224-1817"]
["08-2903-0602","45-4582-0912","09-2829-0775"]
["08-2904-0602","47-0226-3829","09-2830-0773"]
["08-3012-1412","47-0715-4535","12-0350-0092"]
["08-3095-0293","47-0820-4177","12-0552-0091"]
["08-3095-0294","47-1008-3996","12-0699-0014"]
["08-3351-0644","47-1180-3205","12-0752-0048"]
["08-3353-0739","47-1180-3206","12-0953-0100"]
["08-3369-1563","47-1216-3205","12-1041-0201"]
["12-2730-0100","47-1318-3822","12-1143-0276"]
["12-4352-1989","47-1318-3900","12-1224-0598"]
["12-4352-1990","47-1318-3901","12-1848-1074"]
["12-5454-3269","47-1318-3902","12-1866-0199"]
["14-1276-0700","47-1644-4503","12-1867-0199"]
["18-1584-1732","47-1657-3706","12-1900-0704"]
["19-3392-1410","47-1796-5417","12-1921-0900"]
["20-0004-1798","47-1796-5418","12-1925-0602"]
["20-0005-1134","47-1845-3910","12-1925-0603"]
["20-0005-1135","47-1845-3911","12-1925-0604"]
["20-0005-1136","47-1846-3910","12-1938-0239"]
["20-0005-1194","47-2056-5518","12-1938-0240"]
["20-0005-1375","47-2597-6176","12-1938-0241"]
["20-0005-1376","47-2681-5311","12-2024-1294"]
["20-0053-0996","47-3190-5623","12-2039-0250"]
["20-0104-2599","47-3191-5915","12-2047-1317"]
["20-0119-0305","47-3191-5916","12-2047-1318"]
["20-0152-2398","47-3191-5917","12-2055-1099"]
["20-0160-1798","47-3309-4418","12-2055-1100"]
["20-0164-0464","47-4056-0914","12-2103-0701"]
["20-0165-0126","47-4056-0915","12-2234-0139"]
["20-0165-0127","47-4523-3908","12-2237-0318"]
["20-0165-0128","47-4523-3909","12-2237-0319"]
["20-0176-0769","47-5041-4308","12-2239-0532"]
["20-0194-0305","47-5070-2653","12-2239-0533"]
["20-0195-1798","47-5076-5157","12-2239-0534"]
["20-0199-2527","47-5076-5158","12-2240-0768"]
["20-0199-2528","47-5116-2603","12-2243-1048"]
["20-0200-0954","47-5116-2604","12-2269-0601"]
["20-0200-0955","47-5270-3109","12-2335-0097"]
["20-0200-1459","47-5270-3110","12-2344-0298"]
["20-0200-1460","47-5290-4034","12-2362-1102"]
["20-0200-1461","47-5301-2097","12-2365-0398"]
["20-0200-1503","47-5382-3921","12-2365-0399"]
["20-0200-1504","47-5445-3101","12-2437-0524"]
["20-0200-2364","47-5457-1116","12-2438-0628"]
["20-0200-2365","47-5568-2911","12-2442-1251"]
["20-0200-2366","47-5571-3055","12-2442-2269"]
["20-0200-2387","47-5583-0717","12-2442-2270"]
["20-0200-2388","47-5584-0717","12-2476-1300"]
["20-0201-1033","47-5794-0839","12-2643-1581"]
["20-0201-1034","47-5794-0840","12-2658-2086"]
["20-0201-1572","47-5987-1221","12-2736-1891"]
["20-0201-1573","47-6428-0005","12-2736-1892"]
["20-0202-2212","47-6428-0006","12-2742-1897"]
["20-0202-2213","47-6903-1832","12-2742-2125"]
["20-0273-1797","47-7327-1115","12-2745-1490"]
["20-0294-2034","47-7345-0214","12-2764-1392"]
["20-0295-1962","48-0145-2536","12-2777-1103"]
["20-0296-2149","48-0147-2537","12-2786-2086"]
["20-0300-1773","48-0191-2536","12-2786-2087"]
["20-0372-2197","48-0192-2536","12-2804-2086"]
["20-0397-1396","48-1496-1937","12-2835-1303"]
["20-0398-1396","48-1895-2108","12-2840-1779"]
["20-0421-2197","48-2120-1984","12-2841-2080"]
["20-0496-2584","48-2351-1956","12-2843-1887"]
["20-0496-2585","48-2352-2837","12-2847-1291"]
["20-0496-2741","48-2419-1065","12-2847-1292"]
["20-0499-2353","48-2855-2904","12-2848-2086"]
["20-0535-2197","48-2948-1009","12-2848-2087"]
["20-0535-2198","48-2948-1010","12-2850-1787"]
["20-0541-2197","52-10047-1376","12-2880-1886"]
["20-0542-2197","52-10047-1377","12-2905-2087"]
["20-0543-2197","52-10047-1378","12-2906-2087"]
["20-0560-2498","52-10145-3267","12-2906-2088"]
["20-0563-2498","52-1881-3511","12-2936-1788"]
["20-0572-0896","52-2163-4432","12-2940-1789"]
["20-0611-0023","52-2163-4433","12-2940-1790"]
["20-0611-0024","52-2379-4399","12-2941-1977"]
["20-0679-2497","52-2396-3834","12-2955-1887"]
["20-0699-0895","52-2452-2810","12-2968-1788"]
["20-0699-0896","52-2453-2810","12-3007-1490"]
["20-0728-0895","52-2495-2879","12-3015-2186"]
["20-0729-0895","52-2495-2880","12-3016-2187"]
["20-0729-0896","52-2500-2901","12-3021-2186"]
["20-0746-1096","52-2500-2902","12-3022-2186"]
["20-0746-1097","52-2501-2902","12-3022-2187"]
["20-0746-1098","52-2608-4028","12-3029-0542"]
["20-0747-1096","52-3179-2662","12-3063-2386"]
["20-0861-2198","52-3293-3911","12-3091-1889"]
["20-0861-2199","52-3511-2906","12-3091-1890"]
["20-0940-1395","52-3596-2921","12-3138-1420"]
["20-0941-1395","52-3625-2902","12-3139-1420"]
["20-0941-1396","52-3739-3995","12-3140-1576"]
["20-0951-0304","52-3745-2593","12-3143-1637"]
["20-0952-0304","52-4188-4521","12-3171-1274"]
["20-0953-0304","52-4233-4414","12-3171-1275"]
["20-1039-0605","52-4385-2670","12-3188-1576"]
["20-1045-0605","52-4385-2671","12-3189-1576"]
["20-1070-0605","52-4385-2672","12-3269-1577"]
["20-1071-0605","52-4471-3121","12-3350-1380"]
["20-1168-0897","52-4521-2829","12-3351-1380"]
["20-1169-0897","52-4521-2830","12-3375-2079"]
["20-1291-2112","52-4548-3107","12-3408-2179"]
["20-1292-2222","52-4549-3053","12-3454-1938"]
["20-1292-2223","52-4564-3087","12-3454-1939"]
["20-1292-2224","52-4570-3043","12-3749-2681"]
["20-1294-2328","52-4576-3109","12-3749-2682"]
["20-1294-2329","52-4621-3270","12-3753-2681"]
["20-1294-2330","52-4664-2663","12-3754-2216"]
["20-1294-2491","52-4691-3359","12-3755-2372"]
["20-1294-2512","52-4737-3266","12-3755-2373"]
["20-1295-2655","52-4738-3266","12-3755-2436"]
["20-1295-2656","52-4754-2663","12-3755-2572"]
["20-1304-0012","52-4994-3514","12-3755-2573"]
["20-1304-0134","52-4994-3515","12-3756-2324"]
["20-1304-0135","52-5011-2562","12-3777-2080"]
["20-1305-0163","52-5011-2563","12-3777-2081"]
["20-1307-1896","52-5180-2562","12-3795-2782"]
["20-1377-0605","52-5180-2563","12-3806-2180"]
["20-1391-1794","52-5244-3554","12-3807-2181"]
["20-1391-1795","52-5255-3491","12-3816-2481"]
["20-1391-1796","52-5486-2886","12-3816-2482"]
["20-1451-0893","52-5585-2826","12-3821-2281"]
["20-1452-0893","52-5585-2827","12-3831-2281"]
["20-1553-1194","52-5585-2875","12-3835-2481"]
["20-1553-1195","52-5681-2964","12-3849-2281"]
["20-1587-0753","52-5750-2964","12-3857-2849"]
["20-1603-0027","52-5750-2965","12-3954-2226"]
["20-1603-0028","52-5752-3579","12-3972-2181"]
["20-1603-0086","52-5792-3381","12-4137-2785"]
["20-1603-0087","52-5792-3382","12-4151-1682"]
["20-1603-0175","52-5879-2965","12-4156-2530"]
["20-1604-0174","52-5879-2966","12-4156-2765"]
["20-1604-0175","52-5879-2967","12-4181-2385"]
["20-1604-0209","52-5879-2969","12-4186-2785"]
["20-1605-0281","52-5886-2945","12-4282-1782"]
["20-1605-0346","52-5886-2946","12-4294-1882"]
["20-1606-0381","52-6159-2765","12-4303-2484"]
["20-1606-0470","52-6160-2765","12-4345-1581"]
["20-1606-0491","52-6376-2764","12-4348-1983"]
["20-1606-0523","52-6383-2776","12-4352-2786"]
["20-1640-1194","52-6383-2777","12-4358-2554"]
["20-1687-1231","52-6633-2765","12-4358-2555"]
["20-1689-1656","52-6687-3166","12-4358-3400"]
["20-1689-1657","52-6687-3192","12-4359-2778"]
["20-1689-1658","52-6687-3193","12-4359-2882"]
["20-1693-2645","52-6709-2765","12-4375-3441"]
["20-1694-2629","52-6881-2813","12-4377-3388"]
["20-1694-2630","52-7078-2652","12-4390-3288"]
["20-1694-2631","52-7079-2731","12-4393-1481"]
["20-1694-2645","52-7079-2732","12-4394-1481"]
["20-1699-2497","52-7080-2781","12-4401-1581"]
["20-1772-0893","52-7081-2832","12-4401-1582"]
["20-1784-0893","52-7324-2866","12-4439-1882"]
["20-1854-0893","52-7353-2867","12-4449-1716"]
["20-1953-0894","52-7480-2866","12-4449-1717"]
["20-1986-0653","52-7542-2867","12-4449-1763"]
["20-1986-1222","52-8532-1217","12-4449-1764"]
["20-1986-1223","52-8532-1218","12-4558-2771"]
["20-1988-0993","52-8533-1218","12-4563-3265"]
["20-1989-0797","52-8937-3753","12-4574-2988"]
["20-1989-0867","52-9099-1765","12-4577-3585"]
["20-1990-2012","52-9125-1769","12-4581-3782"]
["20-1991-2228","52-9136-1769","12-4680-3589"]
["20-1991-2498","52-9258-1470","12-4838-3289"]
["20-1994-0609","52-9352-1470","12-4860-2908"]
["20-1994-1151","52-9438-1566","12-4862-3518"]
["20-1995-0608","52-9439-1728","12-4863-3337"]
["20-1995-0609","52-9450-1941","12-4863-3544"]
["20-2002-0003","52-9509-3967","12-4875-1983"]
["20-2002-0004","52-9530-3716","12-4876-2184"]
["20-2004-0346","52-9531-3716","12-4878-1983"]
["20-2004-0347","52-9531-3717","12-4878-1984"]
["20-2004-0348","52-9558-0657","12-4904-3691"]
["20-2004-0506","52-9558-0658","12-4914-1681"]
["20-2041-1883","52-9558-0659","12-4922-2989"]
["20-2095-0994","52-9590-0537","12-4948-2285"]
["20-2096-0994","52-9677-2368","12-4954-3591"]
["20-2125-1045","52-9715-0452","12-4957-2575"]
["20-2125-1046","52-9717-0451","12-4960-2916"]
["20-2125-1047","52-9753-0410","12-4962-3321"]
["20-2133-2196","52-9753-0411","12-5054-2268"]
["22-1786-1195","52-9786-3267","12-5054-2276"]
["22-2048-0621","52-9787-3267","12-5066-3585"]
["23-3713-0406","53-0669-1268","12-5068-3819"]
["24-3282-3275","53-0753-0567","12-5080-3800"]
["24-3606-0184","53-0754-0567","12-5101-3699"]
["25-0302-1171","53-0865-1318","12-5104-3699"]
["25-0302-1172","53-1002-5560","12-5116-2689"]
["25-1292-0652","53-1002-5561","12-5249-1886"]
["25-1294-1027","53-1380-3363","12-5253-2109"]
["25-1295-1251","53-1398-3363","12-5260-2947"]
["25-1296-1533","53-1631-3364","12-5274-3071"]
["25-1296-1554","53-1894-4518","12-5276-4097"]
["25-1593-1001","53-1895-4518","12-5301-2996"]
["25-1791-0586","53-1949-3565","12-5351-1806"]
["25-2104-2407","53-1950-3565","12-5353-2096"]
["25-2190-0076","53-2044-3465","12-5358-3696"]
["25-2190-0077","53-2084-5882","12-5368-3784"]
["25-2190-0441","53-2084-5883","12-5376-2791"]
["25-2191-0614","53-2090-5853","12-5376-2792"]
["25-2191-0761","53-2090-5854","12-5393-3996"]
["25-2191-0762","53-2090-5855","12-5453-2047"]
["25-2194-1327","53-2284-3264","12-5455-2195"]
["25-2194-1328","53-2285-3264","12-5530-3682"]
["25-2196-1558","53-2325-3693","12-5532-2288"]
["25-2196-1559","53-2326-3692","12-5544-3494"]
["25-2197-1709","53-2683-5811","12-5551-3191"]
["25-2197-1710","53-2683-5812","12-5576-3691"]
["25-2197-1821","53-3188-5744","12-5582-3401"]
["25-2200-2290","53-3416-6262","12-5585-3981"]
["25-2200-2348","53-3416-6263","12-5593-3593"]
["25-2281-1906","53-3978-6062","12-5595-2979"]
["25-2395-1600","53-3979-6062","12-5618-2689"]
["25-2399-2328","53-3982-2766","12-5619-2688"]
["25-2534-0103","53-4013-2766","12-5624-2980"]
["25-2676-0705","53-4013-2767","12-5652-2065"]
["25-2765-2207","53-4060-5663","12-5658-2346"]
["25-2923-2208","53-4061-5663","12-5660-2406"]
["25-2989-0786","53-4313-2677","12-5667-4086"]
["25-2990-0886","53-4320-2767","12-5670-3779"]
["25-2991-1086","53-4321-2766","12-5676-2088"]
["25-2992-1271","53-4508-1871","12-5677-2088"]
["25-3285-1907","53-4508-1872","12-5761-2289"]
["25-3578-0106","53-4508-1873","12-5770-2950"]
["25-3595-1763","53-4508-1874","12-5771-2938"]
["25-3595-1878","53-4517-3024","12-5773-3504"]
["25-3595-2161","53-4526-5268","12-5831-2089"]
["25-3606-1907","54-0463-2308","12-5840-3681"]
["25-3670-0471","54-0464-2309","12-5860-2406"]
["25-3693-1988","54-0827-1207","12-5861-3983"]
["25-3762-1108","54-0871-2282","12-5868-2585"]
["25-3944-1108","54-0871-2283","12-5869-2848"]
["25-3976-1908","54-0911-0535","12-5872-3367"]
["25-4015-0106","54-1066-1539","12-5881-2585"]
["25-4068-0377","54-1070-0723","12-5882-3082"]
["25-4094-2232","54-1366-0673","12-5965-3682"]
["25-4094-2251","54-1466-1509","12-5978-3183"]
["25-4095-2320","54-1466-1510","12-5996-3782"]
["26-0145-1009","54-1565-0770","12-6031-2290"]
["26-0205-0204","54-1565-0771","12-6056-2251"]
["26-0300-0505","54-1565-0772","12-6058-2314"]
["26-0300-0508","54-1569-2345","12-6063-2774"]
["26-0340-1008","54-1569-2346","12-6101-3183"]
["26-0433-0205","54-1693-1910","12-6101-3184"]
["26-1272-0175","54-1694-1910","12-6116-2290"]
["26-1272-0244","54-1766-1625","12-6116-2291"]
["26-1273-0320","54-1767-1674","12-6143-2587"]
["26-1273-0548","54-1767-1860","13-0003-0808"]
["26-1281-0463","54-1767-1965","13-0032-0502"]
["26-1527-0492","54-1864-0705","13-0032-0503"]
["26-1538-0504","54-1865-0981","13-0093-0157"]
["26-1692-1021","54-1865-0982","13-0093-0163"]
["26-1768-2318","54-1866-1257","13-0094-0398"]
["26-1837-2317","54-1868-2107","13-0095-0479"]
["26-1860-0800","54-1868-2108","13-0097-0653"]
["26-1861-0609","54-1898-1110","13-0097-0654"]
["26-1861-0694","54-1899-1110","13-0125-3236"]
["26-1861-0892","54-1966-1295","13-0135-3204"]
["26-1862-0922","54-1972-0310","13-0152-2603"]
["26-1865-1113","54-1972-0311","13-0152-2604"]
["26-1866-1122","54-1978-1310","13-0208-3505"]
["26-1868-1222","54-1978-1311","13-0208-3506"]
["26-1868-1388","54-2057-0177","13-0216-1704"]
["26-1886-1619","54-2058-0178","13-0219-2403"]
["26-1938-1319","54-2379-2012","13-0219-2404"]
["26-1976-1772","54-2388-0810","13-0222-1961"]
["26-2019-1320","54-2518-0107","13-0222-2368"]
["26-2066-0282","54-2518-0108","13-0222-2369"]
["26-2068-0551","54-2518-0109","13-0223-2620"]
["26-2229-1324","54-2538-0509","13-0223-2621"]
["26-2241-2222","54-2563-1162","13-0224-3119"]
["26-2366-1684","54-2564-1214","13-0224-3120"]
["26-2369-1724","54-2564-1215","13-0225-3310"]
["26-2458-1724","54-2565-1800","13-0225-3311"]
["26-2466-0312","54-2565-1801","13-0249-1613"]
["26-2467-0525","54-2628-1111","13-0272-2603"]
["26-2553-1005","54-2656-0042","13-0280-1303"]
["26-2568-1723","54-2664-0508","13-0296-0875"]
["26-2604-1722","54-2667-1911","13-0297-1101"]
["26-2666-0268","54-2667-1912","13-0297-1102"]
["26-2666-0454","54-2668-1912","13-0298-1135"]
["26-2668-1954","54-2668-1913","13-0299-1312"]
["26-2672-2326","54-2688-1211","13-0299-1737"]
["26-2673-2400","54-2762-1165","13-0311-2904"]
["26-3027-0918","54-2763-1165","13-0332-0904"]
["26-3054-0809","54-2855-1110","13-0396-0840"]
["26-3054-1401","54-2855-1111","13-0396-0928"]
["26-3054-1459","54-2857-0047","13-0421-1977"]
["26-3055-1221","54-2902-0106","13-0421-2238"]
["26-3058-1674","54-2903-0106","13-0448-3507"]
["26-3065-2181","54-2927-1210","13-0456-1605"]
["26-3065-2209","54-2927-1211","13-0461-3507"]
["26-3193-0496","54-2961-0881","13-0468-3207"]
["26-3528-1314","54-2962-1066","13-0485-2906"]
["26-3609-1314","54-2962-1067","13-0489-3507"]
["26-3640-1314","54-2962-1187","13-0500-2506"]
["26-3707-1114","54-2962-1197","13-0523-3207"]
["28-0129-2563","54-3036-1912","13-0524-3207"]
["28-0210-2689","54-3060-1388","13-0533-2106"]
["28-0631-4898","54-3061-1498","13-0537-1216"]
["28-0721-2899","54-3067-2029","13-0596-1415"]
["28-0871-4898","54-3067-2030","13-0600-1213"]
["28-1190-3108","54-3067-2056","13-0621-1819"]
["28-1199-4658","54-3067-2057","13-0621-1820"]
["28-1601-2680","54-3067-2090","13-0621-1997"]
["28-3326-4299","54-3067-2091","13-0621-1998"]
["30-0530-4744","54-3067-2212","13-0621-2048"]
["30-0693-1413","54-3067-2213","13-0621-2049"]
["30-0706-1413","54-3068-2261","13-0622-1838"]
["30-0726-1413","54-3068-2262","13-0622-3064"]
["30-1095-2158","54-3068-2263","13-0627-2506"]
["30-1095-2237","54-3068-2264","13-0644-1708"]
["30-1127-3784","54-3237-2313","13-0698-1402"]
["30-1129-4525","54-3237-2314","13-0720-2996"]
["30-1226-4340","54-3405-2012","13-0720-3259"]
["30-1280-4340","54-3405-2013","13-0720-3260"]
["30-1331-4340","54-3420-1912","13-0722-3937"]
["30-1403-2838","54-3423-1813","13-0763-1408"]
["30-1529-4340","57-3998-3886","13-0763-1409"]
["30-1773-4440","57-3998-3983","13-0798-1417"]
["30-1914-2858","57-4438-4021","13-0798-1679"]
["30-1981-1613","58-3092-1785","13-0815-1911"]
["30-2121-4440","58-3092-1786","13-0817-2183"]
["30-2125-1613","58-3092-1787","13-0820-2878"]
["30-2213-4442","58-3092-1788","13-0820-3265"]
["30-2351-4442","58-3254-1524","13-0820-3272"]
["32-0628-2238","59-0328-4251","13-0822-3906"]
["32-3010-4800","59-0733-3040","13-0848-2005"]
["32-3913-1502","59-1384-1595","13-0857-3508"]
["32-4777-1168","59-2512-2563","13-0904-2005"]
["32-5002-1168","59-3186-4118","13-0920-2981"]
["32-5032-1168","59-3295-3394","13-0927-2908"]
["34-0422-1897","59-3329-3360","13-0927-2909"]
["34-2896-1586","59-3511-3219","13-0973-3508"]
["36-1022-3963","59-3561-3220","13-1063-4007"]
["36-1023-3591","59-3645-3220","13-1096-4107"]
["36-1029-3694","59-3835-3023","13-1097-3808"]
["36-1030-3551","59-3873-3149","13-1097-3809"]
["36-1034-3814","59-4167-3969","13-1099-2007"]
["36-1035-4018","60-0782-1329","13-1103-4207"]
["36-1036-3852","60-0783-1328","13-1119-3454"]
["36-1052-4070","60-1891-1538","13-1141-4008"]
["36-1054-1103","60-1892-1538","13-1293-2908"]
["36-1054-4122","60-1892-1539","13-1378-2908"]
["36-1061-3222","60-1978-0245","13-1633-1109"]
["36-1073-3476","60-1979-0402","13-1689-3709"]
["36-1076-3313","60-1979-0403","13-1700-3410"]
["36-1079-3121","60-2194-2420","13-1793-1269"]
["36-1083-3412","60-2313-0115","13-1793-1270"]
["36-1083-3413","60-2314-0114","13-1830-3709"]
["36-1089-3359","60-2862-0003","13-1831-3709"]
["36-1156-1103","60-2862-0004","13-1894-3410"]
["36-1156-1104","60-3255-2118","13-2144-0610"]
["36-1373-1903","60-3255-2119","13-2255-4010"]
["36-1597-1992","60-3255-2120","13-2325-3811"]
["36-1682-1802","60-3270-0043","14-0022-0604"]
["36-1682-1803","60-3284-1158","14-0043-0702"]
["36-1682-1804","60-3291-2196","14-0101-1684"]
["36-1738-1798","60-3404-2220","14-0141-0604"]
["36-2084-1607","60-3767-0068","14-0199-0858"]
["36-2084-1608","60-3767-0069","14-0199-1202"]
["36-2084-1609","60-3993-1816","14-0199-1203"]
["36-2094-1575","60-3995-1616","14-0200-0612"]
["36-2094-1576","60-3996-1615","14-0200-0802"]
["36-2130-1501","60-4078-1394","14-0201-0587"]
["36-2196-1501","60-4265-0057","14-0203-0801"]
["36-2196-1502","60-4265-0058","14-0295-1299"]
["36-2409-1501","60-4291-0112","14-0299-1096"]
["36-2502-1500","60-4291-0113","14-0351-1805"]
["36-2773-0548","60-4291-0114","14-0387-0603"]
["36-2773-0549","60-4306-0005","14-0396-1299"]
["36-2774-0548","60-4306-0006","14-0396-1302"]
["36-2775-0547","60-4306-0007","14-0398-1653"]
["36-2775-0795","60-4307-0005","14-0399-0028"]
["36-2846-3584","60-4366-0005","14-0400-0232"]
["36-3266-0182","60-4367-0005","14-0402-0187"]
["36-3500-3687","60-4367-0006","14-0402-0575"]
["36-3514-3687","60-4682-2039","14-0403-0513"]
["36-3546-3686","60-4682-2040","14-0406-0408"]
["36-3596-3285","60-4685-2245","14-0456-0700"]
["36-3882-3685","60-4685-2246","14-0492-0100"]
["36-4010-3686","60-4685-2247","14-0499-0643"]
["36-4258-0498","60-4965-0062","14-0501-0147"]
["38-0125-0507","60-4965-0063","14-0501-0149"]
["38-0125-0508","60-4966-0148","14-0503-0500"]
["38-0168-0432","60-4967-0302","14-0507-0400"]
["38-0259-0801","60-4982-2044","14-0538-0603"]
["38-0296-1545","60-4982-2045","14-0558-0403"]
["38-0485-0601","60-4985-2368","14-0596-0603"]
["38-0486-0527","60-4985-2369","14-0596-0604"]
["38-0495-1332","62-0155-1140","14-0597-1189"]
["38-0538-1409","62-0155-1141","14-0597-1503"]
["38-0613-0329","62-0158-1141","14-0598-1146"]
["38-0614-0329","62-0159-1141","14-0598-1403"]
["38-0685-1400","64-0748-2026","14-0599-0622"]
["38-0692-1419","64-0767-2142","14-0599-0918"]
["38-0692-1442","64-0817-1976","14-0600-0801"]
["38-0695-2169","64-0899-1988","14-0600-1502"]
["38-0817-1600","64-0917-1906","14-0600-1703"]
["38-0879-1194","64-0929-1901","14-0601-1926"]
["38-0883-1193","64-0982-1831","14-0615-1201"]
["38-0892-1702","65-1076-0459","14-0635-0102"]
["38-0892-1744","65-1477-1628","14-0642-1979"]
["38-0892-1757","65-1720-0705","14-0694-1401"]
["38-0957-1600","65-1727-2306","14-0694-1500"]
["38-0991-1538","65-1727-2307","14-0695-1503"]
["38-1183-1201","65-1774-1011","14-0695-1703"]
["38-1300-0213","65-2030-1406","14-0800-2005"]
["38-1301-0212","65-2066-1406","14-0875-0711"]
["38-1302-0212","65-2172-1305","14-0875-1201"]
["38-1318-0107","65-2196-0102","14-0894-0800"]
["38-1319-0107","65-2271-0620","14-0894-0871"]
["38-1500-2404","65-2271-0621","14-0895-1259"]
["38-1533-2928","65-2271-0680","14-0896-0147"]
["38-1533-2929","65-2275-1224","14-0898-0602"]
["38-1966-3015","65-2357-1205","14-0942-0302"]
["38-1966-3016","65-2358-1906","14-0945-0828"]
["38-1966-3018","65-2371-0604","14-0945-0930"]
["38-1978-1083","65-2371-0641","14-0954-1400"]
["38-1978-1089","65-2412-1606","14-1050-1501"]
["38-1987-2920","65-2443-1906","14-1050-1502"]
["38-2039-2000","65-2448-1205","14-1095-0174"]
["38-2059-2000","65-2519-1105","14-1096-0037"]
["38-2185-2877","65-2554-1606","14-1124-1936"]
["38-2186-2876","65-2577-1105","14-1138-1702"]
["38-2186-2877","65-2582-2241","14-1149-0700"]
["38-2355-2754","65-2672-1023","14-1196-0455"]
["38-2373-0622","65-2801-2007","14-1196-1259"]
["38-2375-0895","65-2801-2008","14-1196-1283"]
["38-2376-1206","65-2880-0403","14-1196-1401"]
["38-2380-1947","65-2911-0504","14-1196-1424"]
["38-2380-1948","65-2919-1406","14-1197-0777"]
["38-2380-1950","65-2976-1491","14-1276-0101"]
["38-2383-0102","65-2976-1492","14-1297-1815"]
["38-2384-2752","65-2981-2137","14-1297-1870"]
["38-2572-0704","65-3701-0410","14-1306-1902"]
["38-2574-1570","68-0088-0306","14-1359-0401"]
["38-2575-1816","68-0105-1606","14-1394-0374"]
["38-2579-2137","68-0109-1102","14-1395-0929"]
["38-2581-2374","68-0111-1607","14-1395-1703"]
["38-2581-2375","68-0112-1606","14-1396-1191"]
["38-2673-1589","68-0112-1769","14-1396-1198"]
["38-2680-1501","68-0124-1406","14-1432-1100"]
["38-2682-2502","68-0128-1706","14-1442-0602"]
["38-2749-1501","68-0164-1706","14-1446-1852"]
["38-2771-0730","68-0165-0306","14-1448-1541"]
["38-2772-0757","68-0213-1705","14-1448-1611"]
["38-2798-0600","68-0279-1103","14-1464-1402"]
["38-2875-1802","68-0309-1138","14-1466-0101"]
["38-2876-1924","68-0309-1139","14-1496-1173"]
["38-2881-2496","68-0316-1903","14-1497-1371"]
["38-2911-1501","68-0316-1904","14-1497-1401"]
["38-2979-2349","68-0338-1705","14-1522-0101"]
["38-3009-1500","68-0382-0221","14-1554-1602"]
["38-3059-0601","68-0395-1003","14-1566-1602"]
["38-3068-0646","68-0395-1004","14-1577-0401"]
["38-3072-1039","68-0398-1004","14-1588-0800"]
["38-3102-0401","68-0407-1103","14-1597-1624"]
["38-3103-0401","68-0408-0984","14-1617-0451"]
["38-3199-0351","68-0408-0998","14-1620-0101"]
["38-3200-0351","68-0409-1105","14-1644-0749"]
["38-3336-0301","68-0412-0305","14-1658-0401"]
["38-3357-0601","68-0419-2119","14-1668-1100"]
["38-3363-0330","68-0419-2120","14-1732-1303"]
["38-3365-0482","68-0421-1004","14-1762-2105"]
["38-3377-2457","68-0452-0244","14-1770-0201"]
["38-3505-2502","68-0463-1004","14-1777-1403"]
["38-3506-2502","68-0498-1705","14-1784-2205"]
["38-3530-2502","68-0514-0240","15-0045-2303"]
["39-0000-1801","68-0542-0248","15-0203-1569"]
["39-0000-1802","68-0608-1077","15-0267-1802"]
["39-0001-1549","68-0677-1955","15-0310-1843"]
["39-0001-1720","68-0743-1004","15-0352-2002"]
["39-0001-1721","68-0743-1005","15-0360-0200"]
["39-0002-1311","68-0808-1076","15-0395-0300"]
["39-0002-1312","68-0942-1904","15-0401-0219"]
["39-0002-1354","68-1006-0915","15-0403-0330"]
["39-0002-1355","68-1016-1945","15-0411-1950"]
["39-0002-1356","68-1016-1946","15-0729-0200"]
["39-0002-1357","68-1081-0595","15-0798-0300"]
["39-0077-0416","68-1110-0686","15-0829-0200"]
["39-0077-0417","68-1192-0732","15-0960-0703"]
["39-0084-0815","68-1417-2039","15-1107-2253"]
["39-0084-0816","68-1417-2040","15-1193-0813"]
["39-0084-0817","69-0402-4128","15-1199-0988"]
["39-0099-0502","69-0562-3814","15-1246-2203"]
["39-0099-0503","69-0785-4297","15-1302-0406"]
["39-0259-2212","69-0785-4298","15-1378-1103"]
["39-0259-2213","69-0810-1317","15-1385-0703"]
["39-0259-2214","69-1062-2887","15-1385-0802"]
["39-0395-1914","69-1101-0202","15-1385-0803"]
["39-0395-1915","69-1218-4491","15-1386-0802"]
["39-0397-1911","69-1218-4492","15-1386-0803"]
["39-0397-1912","69-1378-4216","15-1387-0802"]
["39-0397-2089","69-1533-4213","15-1387-0803"]
["39-0397-2090","69-1572-0116","15-1401-1203"]
["39-0397-2091","69-1584-0402","15-1452-0806"]
["39-0397-2092","69-1585-0402","15-1452-0807"]
["39-0398-1873","69-1664-0402","15-1452-0808"]
["39-0400-1239","69-1666-0402","15-1452-0809"]
["39-0400-1240","69-1707-1597","15-1452-0810"]
["39-0496-0075","69-1814-4212","15-1452-0811"]
["39-0496-0076","69-1943-2838","15-1471-2205"]
["39-0496-0077","69-1943-2839","15-1501-2226"]
["39-0557-0315","69-1943-2840","15-1544-0105"]
["39-0557-0316","69-2181-2802","15-1567-0105"]
["39-0557-0317","69-2181-2803","15-1614-1162"]
["39-0650-0814","69-3140-4609","15-1626-1303"]
["39-0651-0814","69-3140-4610","15-1626-1304"]
["39-0651-0815",null,"15-1643-2107"]
["39-0690-0081",null,"15-1711-0683"]
["39-0693-0621",null,"15-1740-0606"]
["39-0694-0913",null,"15-1740-0607"]
["39-0695-1061",null,"15-1751-2308"]
["39-0695-1062",null,"15-1798-0854"]
["39-0696-1149",null,"15-1799-0700"]
["39-0701-0414",null,"15-1799-0701"]
["39-0765-0314",null,"15-1857-2304"]
["39-0765-0315",null,"15-1899-1407"]
["39-0778-0314",null,"15-1900-1407"]
["39-0778-0315",null,"15-1932-0604"]
["39-0871-0414",null,"15-1932-0605"]
["39-0994-2308",null,"15-1975-1407"]
["39-0994-2310",null,"15-1978-1407"]
["39-1026-0814",null,"15-1989-0144"]
["39-1057-0814",null,"15-1989-0145"]
["39-1088-0051",null,"15-1989-0146"]
["39-1088-0059",null,"15-1989-0232"]
["39-1178-1914",null,"15-1992-1407"]
["39-1299-1912",null,"15-1993-1407"]
["39-1358-0813",null,"15-1994-2283"]
["39-1358-0814",null,"15-1994-2317"]
["39-1512-1912",null,"15-1994-2318"]
["39-1512-1913",null,"15-1994-2319"]
["39-1512-1914",null,"15-1995-2305"]
["39-1887-0956",null,"15-1995-2340"]
["39-1887-0957",null,"15-1997-1412"]
["39-1887-0958",null,"15-1997-1413"]
["39-1887-0959",null,"15-1997-1414"]
["39-1905-0813",null,"15-1997-1415"]
["39-1906-0813",null,"15-1997-1416"]
["39-1906-0814",null,"15-1998-1099"]
["39-1906-0815",null,"15-1998-1100"]
["39-2064-0815",null,"15-1998-1130"]
["39-2282-1131",null,"15-2008-0103"]
["39-2282-1132",null,"15-2087-0074"]
["39-2286-0612",null,"15-2087-0075"]
["39-2387-1509",null,"15-2087-0101"]
["39-2387-1510",null,"15-2087-0102"]
["39-2387-1511",null,"15-2088-0228"]
["39-2387-1512",null,"15-2088-0229"]
["39-2407-1222",null,"15-2090-2012"]
["39-2478-0178",null,"15-2095-0782"]
["39-2479-0262",null,"15-2095-0783"]
["39-2484-2213",null,"15-2095-0784"]
["39-2552-1616",null,"15-2095-0785"]
["39-2552-1617",null,"15-2097-1374"]
["39-2557-0814",null,"15-2097-1416"]
["39-2557-0815",null,"15-2098-1101"]
["39-2557-0816",null,"15-2099-1217"]
["39-2584-1029",null,"15-2099-1761"]
["39-2584-1030",null,"15-2099-1762"]
["39-2666-2210",null,"15-2099-1763"]
["39-2685-2071",null,"15-2099-1764"]
["39-2685-2072",null,"15-2101-1407"]
["39-2782-1551",null,"15-2102-1407"]
["39-2881-1011",null,"15-2197-0808"]
["39-2901-1810",null,"15-2197-1315"]
["39-2931-2207",null,"15-2197-1397"]
["39-2931-2208",null,"15-2198-1059"]
["39-2998-1010",null,"15-2203-1306"]
["39-3010-2208",null,"15-2288-0157"]
["39-3010-2209",null,"15-2288-0158"]
["39-3013-0411",null,"15-2288-0159"]
["39-3013-0412",null,"15-2288-0160"]
["39-3026-0111",null,"15-2288-0161"]
["39-3026-0112",null,"15-2289-0301"]
["39-3035-1532",null,"15-2292-2016"]
["39-3036-1532",null,"15-2293-2149"]
["39-3057-1181",null,"15-2295-0762"]
["39-3057-2208",null,"15-2298-1045"]
["39-3058-2208",null,"15-2299-1089"]
["39-3083-1959",null,"15-2341-1902"]
["39-3084-1491",null,"15-2392-1902"]
["39-3176-0198",null,"15-2392-1903"]
["39-3178-0359",null,"15-2394-0781"]
["39-3178-0403",null,"15-2394-2241"]
["39-3178-0795",null,"15-2395-2392"]
["39-3179-0457",null,"15-2397-0608"]
["39-3179-0511",null,"15-2399-1128"]
["39-3180-1030",null,"15-2400-1239"]
["39-3326-2210",null,"15-2400-1240"]
["39-3377-0685",null,"15-2400-1241"]
["39-3377-0686",null,"15-2434-1110"]
["39-3378-0518",null,"15-2443-1110"]
["39-3378-0519",null,"15-2443-1710"]
["39-3378-0520",null,"15-2448-2100"]
["39-3378-0521",null,"15-2460-1110"]
["39-3378-0522",null,"15-2478-1711"]
["39-3381-1262",null,"15-2490-1847"]
["39-3382-1493",null,"15-2491-1939"]
["39-3391-0708",null,"15-2492-1997"]
["40-0204-1337",null,"15-2492-2369"]
["40-2289-0659",null,"15-2493-0610"]
["41-0216-0610",null,"15-2493-2032"]
["41-1451-1608",null,"15-2497-1557"]
["43-2622-3439",null,"15-2498-1743"]
["43-2623-3439",null,"15-2572-0612"]
["43-2624-3439",null,"15-2573-0612"]
["43-3820-2158",null,"15-2589-0648"]
["43-3821-2158",null,"15-2593-0997"]
["43-3880-2158",null,"15-2594-1204"]
["43-3881-2158",null,"15-2596-1698"]
["43-3881-2159",null,"15-2597-1731"]
["43-3882-2158",null,"15-2597-1785"]
["44-1304-0004",null,"15-2600-1209"]
["44-1304-0005",null,"15-2601-1541"]
["44-1323-0004",null,"15-2602-1541"]
["44-1608-2103",null,"15-2618-0807"]
["44-1816-0112",null,"15-2624-1209"]
["44-1889-1912",null,"15-2624-1210"]
["44-2193-0078",null,"15-2624-1211"]
["44-2193-0117",null,"15-2625-2303"]
["44-2193-0163",null,"15-2639-1309"]
["44-2194-0193",null,"15-2666-0012"]
["44-2194-0230",null,"15-2666-0013"]
["44-2194-0261",null,"15-2679-0037"]
["44-2194-0287",null,"15-2679-0038"]
["44-2195-0362",null,"15-2679-0039"]
["44-2295-0412",null,"15-2691-2157"]
["44-2295-0451",null,"15-2733-0112"]
["44-2296-0500",null,"15-2734-0112"]
["44-2296-0547",null,"15-2737-1208"]
["44-2296-0580",null,"15-2786-0212"]
["44-2296-0607",null,"15-2793-1154"]
["44-2296-0625",null,"15-2817-1608"]
["44-2297-0654",null,"15-2834-1608"]
["44-2297-0667",null,"15-2875-1709"]
["44-2297-0690",null,"15-2886-0612"]
["44-2297-0712",null,"15-2888-0912"]
["44-2297-0741",null,"15-2888-0920"]
["44-2297-0778",null,"15-2888-1942"]
["44-2297-0790",null,"15-2888-1973"]
["44-2297-0819",null,"15-2888-2047"]
["44-2297-0847",null,"15-2890-2163"]
["44-2297-0872",null,"15-2890-2164"]
["44-2302-0906",null,"15-2891-2236"]
["44-2306-1003",null,"15-2892-2320"]
["44-2307-0968",null,"15-2892-2368"]
["44-2308-0940",null,"15-2895-1481"]
["50-0740-2416",null,"15-2940-1009"]
["50-2399-0009",null,"15-2954-1207"]
["51-0013-0803",null,"15-2963-0707"]
["51-0098-0439",null,"15-2988-0895"]
["51-0098-0741",null,"15-2989-0990"]
["51-0098-0762",null,"15-2990-2150"]
["51-0296-0381",null,"15-2992-1176"]
["51-0297-0182",null,"15-2994-1290"]
["51-0297-0203",null,"15-2994-1291"]
["51-0600-1958",null,"15-2994-1292"]
["51-0601-1958",null,"16-1143-0130"]
["51-0691-0193",null,"16-1246-0671"]
["51-0692-0192",null,"16-2403-0270"]
["51-0692-0193",null,"18-0016-1330"]
["51-0692-0274",null,"18-0174-1531"]
["51-0693-0047",null,"18-0231-0930"]
["51-0693-0048",null,"18-0390-1534"]
["51-0693-0274",null,"18-0400-1940"]
["51-0792-0449",null,"18-0401-1531"]
["51-0797-0934",null,"18-0403-1769"]
["51-0799-1734",null,"18-0439-0223"]
["51-0800-1709",null,"18-0493-1942"]
["51-0800-1761",null,"18-0499-0299"]
["51-0800-1940",null,"18-0501-0666"]
["51-0800-1951",null,"18-0502-0629"]
["51-0800-1968",null,"18-0603-1618"]
["51-0800-1987",null,"18-0694-0413"]
["51-0800-2026",null,"18-0725-2240"]
["51-0801-1606",null,"18-0751-0424"]
["51-0801-2122",null,"18-0795-0733"]
["51-0802-2169",null,"18-0796-0984"]
["51-0802-2283",null,"18-0801-1325"]
["51-0802-2313",null,"18-0892-0261"]
["51-0841-2008",null,"18-0996-0890"]
["51-0873-2008",null,"18-0997-0910"]
["51-0897-1356",null,"18-0998-1116"]
["51-0997-0805",null,"18-1016-2364"]
["51-0997-0931",null,"18-1040-1132"]
["51-0997-0950",null,"18-1080-2440"]
["51-0997-1003",null,"18-1081-2440"]
["51-0998-0824",null,"18-1096-0917"]
["51-0998-0852",null,"18-1103-1896"]
["51-1194-0807",null,"18-1115-2349"]
["51-1195-0918",null,"18-1117-2425"]
["51-1195-0947",null,"18-1147-2440"]
["51-1195-1000",null,"18-1148-2440"]
["51-1196-1032",null,"18-1149-2440"]
["51-1196-1067",null,"18-1161-0732"]
["51-1196-1110",null,"18-1185-1133"]
["51-1196-1161",null,"18-1239-1534"]
["51-1196-1184",null,"18-1253-0232"]
["51-1196-1186",null,"18-1271-0932"]
["51-1200-1975",null,"18-1297-1169"]
["51-1398-1134",null,"18-1303-1932"]
["51-1401-1277",null,"18-1307-1934"]
["51-1504-1739",null,"18-1437-1532"]
["51-1504-1804",null,"18-1547-1234"]
["51-1504-1824",null,"18-1572-1333"]
["51-1504-1908",null,"18-1699-1419"]
["51-2103-0805",null,"18-1701-1698"]
["51-2136-0801",null,"18-1702-1717"]
["56-2289-0566",null,"18-1731-1134"]
["58-0035-1195",null,"19-0104-1085"]
["58-0039-0895",null,"19-0104-1089"]
["58-0055-1595",null,"19-0105-0852"]
["58-0060-3375",null,"19-0105-0853"]
["58-0060-3492",null,"19-0107-0232"]
["58-0060-3540",null,"19-0107-0233"]
["58-0060-3552",null,"19-0107-0234"]
["58-0060-3574",null,"19-0107-0314"]
["58-0060-3656",null,"19-0107-0315"]
["58-0060-3724",null,"19-0107-0316"]
["58-0060-3754",null,"19-0107-0402"]
["58-0060-3775",null,"19-0115-1104"]
["58-0061-3375",null,"19-0123-0402"]
["58-0061-3511",null,"19-0203-0941"]
["58-0063-1194",null,"19-0204-0941"]
["58-0080-3511",null,"19-0204-0942"]
["58-0087-0292",null,"19-0205-0598"]
["58-0087-1595",null,"19-0205-0599"]
["58-0089-1194",null,"19-0206-0545"]
["58-0097-0894",null,"19-0206-0546"]
["58-0098-2610",null,"19-0206-0547"]
["58-0098-3911",null,"19-0267-1506"]
["58-0105-2025",null,"19-0267-1507"]
["58-0105-2064",null,"19-0270-0303"]
["58-0105-2104",null,"19-0295-1649"]
["58-0106-2287",null,"19-0302-1460"]
["58-0106-2288",null,"19-0302-1461"]
["58-0106-2289",null,"19-0303-0504"]
["58-0106-2297",null,"19-0303-0505"]
["58-0106-2309",null,"19-0304-1717"]
["58-0107-1194",null,"19-0359-1105"]
["58-0110-0893",null,"19-0403-1029"]
["58-0110-3511",null,"19-0404-0745"]
["58-0110-4012",null,"19-0404-0746"]
["58-0119-2610",null,"19-0502-1641"]
["58-0133-1996",null,"19-0506-0482"]
["58-0143-1193",null,"19-0506-0483"]
["58-0151-3512",null,"19-0507-0136"]
["58-0152-0291",null,"19-0507-0137"]
["58-0152-2610",null,"19-0510-0907"]
["58-0154-3817",null,"19-0510-0908"]
["58-0154-3862",null,"19-0511-0907"]
["58-0162-1594",null,"19-0511-0908"]
["58-0175-2610",null,"19-0602-1038"]
["58-0179-3512",null,"19-0605-0494"]
["58-0181-1594",null,"19-0680-0808"]
["58-0196-0290",null,"19-0743-0908"]
["58-0198-0892",null,"19-0747-0708"]
["58-0202-1593",null,"19-0803-0114"]
["58-0213-1393",null,"19-0898-0899"]
["58-0215-4012",null,"19-0901-0366"]
["58-0216-3613",null,"19-0938-0507"]
["58-0217-1593",null,"19-0996-0983"]
["58-0223-1393",null,"19-1093-0708"]
["58-0237-0290",null,"19-1112-0307"]
["58-0237-2611",null,"19-1200-0710"]
["58-0237-3613",null,"19-1202-0286"]
["58-0242-3513",null,"19-1270-0308"]
["58-0242-3514",null,"19-1295-0759"]
["58-0243-0891",null,"19-1513-1010"]
["58-0247-1192",null,"19-1561-2716"]
["58-0256-1593",null,"19-2075-2875"]
["58-0270-0891",null,"19-2293-1706"]
["58-0272-2611",null,"19-2671-2708"]
["58-0273-1191",null,"19-2803-1510"]
["58-0280-3813",null,"19-3155-0621"]
["58-0280-3814",null,"19-3256-0616"]
["58-0281-3813",null,"19-3256-0617"]
["58-0293-0019",null,"19-3397-3020"]
["58-0294-0057",null,"20-0004-1798"]
["58-0294-0105",null,"20-0005-0866"]
["58-0294-0129",null,"20-0005-1647"]
["58-0294-0171",null,"20-0006-0658"]
["58-0295-0247",null,"20-0064-1897"]
["58-0295-0276",null,"20-0083-1295"]
["58-0295-3613",null,"20-0083-1296"]
["58-0298-0748",null,"20-0094-0405"]
["58-0298-0779",null,"20-0100-1386"]
["58-0298-3513",null,"20-0100-1454"]
["58-0299-0973",null,"20-0100-1455"]
["58-0299-1043",null,"20-0100-2357"]
["58-0299-1067",null,"20-0100-2598"]
["58-0299-3162",null,"20-0100-2599"]
["58-0299-3513",null,"20-0100-2600"]
["58-0301-1327",null,"20-0100-2958"]
["58-0302-1593",null,"20-0101-0925"]
["58-0302-1694",null,"20-0101-0964"]
["58-0303-1764",null,"20-0101-1024"]
["58-0304-1090",null,"20-0101-1025"]
["58-0304-1799",null,"20-0101-1593"]
["58-0304-1869",null,"20-0118-2496"]
["58-0304-1892",null,"20-0119-2496"]
["58-0304-1896",null,"20-0119-2497"]
["58-0304-1922",null,"20-0152-0155"]
["58-0304-1964",null,"20-0152-0156"]
["58-0304-1980",null,"20-0161-1096"]
["58-0304-2029",null,"20-0161-1097"]
["58-0304-2092",null,"20-0162-0155"]
["58-0304-2127",null,"20-0163-0155"]
["58-0305-0289",null,"20-0165-2897"]
["58-0305-2156",null,"20-0179-1697"]
["58-0305-2201",null,"20-0179-2197"]
["58-0305-2292",null,"20-0179-2198"]
["58-0305-2297",null,"20-0201-1733"]
["58-0305-2329",null,"20-0201-1734"]
["58-0305-2330",null,"20-0201-1735"]
["58-0305-2331",null,"20-0201-1792"]
["58-0319-4013",null,"20-0206-0005"]
["58-0323-4013",null,"20-0206-0006"]
["58-0323-4014",null,"20-0209-2397"]
["58-0325-3513",null,"20-0213-2046"]
["58-0329-2613",null,"20-0214-0437"]
["58-0333-4014",null,"20-0214-0438"]
["58-0350-3005",null,"20-0214-0439"]
["58-0351-2400",null,"20-0214-1697"]
["58-0351-2437",null,"20-0214-2046"]
["58-0352-2567",null,"20-0248-2052"]
["58-0352-2616",null,"20-0274-0405"]
["58-0352-2642",null,"20-0299-2365"]
["58-0352-2656",null,"20-0299-2366"]
["58-0353-2634",null,"20-0299-2367"]
["58-0353-2649",null,"20-0309-2597"]
["58-0353-2664",null,"20-0309-2598"]
["58-0353-2672",null,"20-0310-2597"]
["58-0353-2690",null,"20-0313-0395"]
["58-0353-2699",null,"20-0313-0396"]
["58-0353-2713",null,"20-0313-0552"]
["58-0353-2723",null,"20-0314-0394"]
["58-0353-2728",null,"20-0326-2499"]
["58-0353-2746",null,"20-0350-1896"]
["58-0353-2796",null,"20-0352-2598"]
["58-0353-2818",null,"20-0395-2646"]
["58-0353-2881",null,"20-0396-2554"]
["58-0353-3074",null,"20-0396-2555"]
["58-0353-3093",null,"20-0396-2647"]
["58-0353-3111",null,"20-0396-2732"]
["58-0353-3210",null,"20-0396-2733"]
["58-0353-3271",null,"20-0396-2734"]
["58-0353-3390",null,"20-0399-0749"]
["58-0353-3443",null,"20-0399-2394"]
["58-0353-3609",null,"20-0399-2395"]
["58-0353-3613",null,"20-0399-2396"]
["58-0353-3614",null,"20-0400-0953"]
["58-0353-3643",null,"20-0400-1405"]
["58-0353-3749",null,"20-0400-1406"]
["58-0354-3890",null,"20-0400-1509"]
["58-0354-3925",null,"20-0400-1510"]
["58-0355-1090",null,"20-0443-1946"]
["58-0355-4060",null,"20-0448-2498"]
["58-0355-4095",null,"20-0454-1096"]
["58-0355-4113",null,"20-0454-1097"]
["58-0355-4117",null,"20-0482-2598"]
["58-0355-4168",null,"20-0482-2599"]
["58-0355-4193",null,"20-0483-1497"]
["58-0361-0689",null,"20-0483-1498"]
["58-0369-1089",null,"20-0489-2297"]
["58-0370-0288",null,"20-0500-0781"]
["58-0389-0287",null,"20-0500-0782"]
["58-0393-1390",null,"20-0500-0818"]
["58-0394-0296",null,"20-0500-0819"]
["58-0395-0299",null,"20-0500-0913"]
["58-0395-0344",null,"20-0500-0915"]
["58-0396-0287",null,"20-0500-0916"]
["58-0396-0370",null,"20-0500-1134"]
["58-0396-0405",null,"20-0500-1517"]
["58-0396-0435",null,"20-0500-1518"]
["58-0397-0601",null,"20-0500-1556"]
["58-0397-0636",null,"20-0500-1557"]
["58-0397-0650",null,"20-0500-1558"]
["58-0405-4014",null,"20-0500-1749"]
["58-0412-3514",null,"20-0500-1750"]
["58-0419-2613",null,"20-0500-1751"]
["58-0420-1593",null,"20-0506-1946"]
["58-0429-3813",null,"20-0529-1547"]
["58-0442-3514",null,"20-0578-1946"]
["58-0449-1088",null,"20-0598-2401"]
["58-0449-1089",null,"20-0598-2647"]
["58-0451-1598",null,"20-0599-2103"]
["58-0458-3514",null,"20-0599-2104"]
["58-0465-1595",null,"20-0600-1033"]
["58-0476-2613",null,"20-0600-1102"]
["58-0480-3813",null,"20-0600-1297"]
["58-0485-1389",null,"20-0600-1298"]
["58-0487-1990",null,"20-0601-1699"]
["58-0488-3514",null,"20-0602-1699"]
["58-0491-3814",null,"20-0603-1297"]
["58-0505-3514",null,"20-0607-1096"]
["58-0521-2614",null,"20-0607-2898"]
["58-0526-3514",null,"20-0607-2899"]
["58-0529-1584",null,"20-0607-2900"]
["58-0531-3814",null,"20-0623-1947"]
["58-0534-0285",null,"20-0624-1947"]
["58-0535-0284",null,"20-0624-1948"]
["58-0545-1086",null,"20-0625-1947"]
["58-0553-1583",null,"20-0625-1948"]
["58-0555-2614",null,"20-0635-2597"]
["58-0556-4015",null,"20-0635-2598"]
["58-0564-3515",null,"20-0646-1889"]
["58-0580-3515",null,"20-0646-1890"]
["58-0581-1086",null,"20-0652-2697"]
["58-0581-1087",null,"20-0653-1295"]
["58-0581-1088",null,"20-0653-2697"]
["58-0582-1086",null,"20-0654-2697"]
["58-0582-1387",null,"20-0674-2597"]
["58-0590-2615",null,"20-0674-2598"]
["58-0601-1603",null,"20-0694-0841"]
["58-0601-1619",null,"20-0694-0842"]
["58-0601-1620",null,"20-0695-0902"]
["58-0601-1633",null,"20-0695-0903"]
["58-0602-1601",null,"20-0695-1062"]
["58-0602-1688",null,"20-0695-1063"]
["58-0602-1689",null,"20-0695-1064"]
["58-0603-1879",null,"20-0695-1326"]
["58-0603-1889",null,"20-0695-1327"]
["58-0603-1900",null,"20-0695-2101"]
["58-0603-2027",null,"20-0696-1101"]
["58-0614-4015",null,"20-0696-1103"]
["58-0619-1687",null,"20-0696-2101"]
["58-0620-0284",null,"20-0697-2245"]
["58-0620-2089",null,"20-0697-2246"]
["58-0648-2616",null,"20-0697-2423"]
["58-0649-4016",null,"20-0697-2424"]
["58-0652-1688",null,"20-0697-2609"]
["58-0653-2931",null,"20-0697-2610"]
["58-0653-3092",null,"20-0697-2688"]
["58-0653-3360",null,"20-0697-2689"]
["58-0653-3361",null,"20-0697-2727"]
["58-0653-3362",null,"20-0697-2728"]
["58-0653-3409",null,"20-0697-2729"]
["58-0653-3421",null,"20-0698-2822"]
["58-0653-3650",null,"20-0698-2823"]
["58-0654-3888",null,"20-0698-2824"]
["58-0654-3914",null,"20-0698-2825"]
["58-0654-3916",null,"20-0700-1896"]
["58-0654-3931",null,"20-0708-0152"]
["58-0654-3980",null,"20-0709-2596"]
["58-0654-3990",null,"20-0709-2597"]
["58-0659-0285",null,"20-0710-0020"]
["58-0677-4016",null,"20-0758-1696"]
["58-0688-1388",null,"20-0795-1331"]
["58-0688-3316",null,"20-0795-1332"]
["58-0689-0285",null,"20-0795-1333"]
["58-0692-0596",null,"20-0796-1175"]
["58-0692-1588",null,"20-0796-1498"]
["58-0693-0008",null,"20-0796-2292"]
["58-0694-0103",null,"20-0797-2291"]
["58-0694-0285",null,"20-0813-1009"]
["58-0694-0585",null,"20-0861-1546"]
["58-0695-0285",null,"20-0861-1547"]
["58-0695-0333",null,"20-0885-0504"]
["58-0695-0664",null,"20-0885-0505"]
["58-0695-0714",null,"20-0885-0506"]
["58-0696-0786",null,"20-0895-1299"]
["58-0696-0986",null,"20-0895-1300"]
["58-0696-0987",null,"20-0895-1301"]
["58-0696-0988",null,"20-0896-1587"]
["58-0696-0993",null,"20-0896-1588"]
["58-0696-1088",null,"20-0896-1589"]
["58-0696-1218",null,"20-0896-2610"]
["58-0697-1287",null,"20-0896-2611"]
["58-0699-1403",null,"20-0897-1197"]
["58-0699-3316",null,"20-0897-1198"]
["58-0700-1509",null,"20-0897-2817"]
["58-0700-1510",null,"20-0897-2818"]
["58-0700-1523",null,"20-0898-1197"]
["58-0700-1595",null,"20-0898-2957"]
["58-0700-1596",null,"20-0906-2698"]
["58-0700-1656",null,"20-0907-0275"]
["58-0700-1988",null,"20-0907-0276"]
["58-0701-1988",null,"20-0907-0277"]
["58-0702-2134",null,"20-0907-0278"]
["58-0730-4016",null,"20-0909-0503"]
["58-0754-4016",null,"20-0931-2597"]
["58-0754-4017",null,"20-0932-2597"]
["58-0754-4018",null,"20-0972-2298"]
["58-0784-1690",null,"20-0984-0006"]
["58-0787-2189",null,"20-0997-2802"]
["58-0787-4016",null,"20-0997-2866"]
["58-0797-0988",null,"20-0997-2867"]
["58-0798-0988",null,"20-0997-2938"]
["58-0798-2617",null,"20-1023-0404"]
["58-0801-0287",null,"20-1023-0405"]
["58-0801-0288",null,"20-1024-0404"]
["58-0801-0289",null,"20-1039-0001"]
["58-0804-3516",null,"20-1039-0002"]
["58-0811-1289",null,"20-1039-0003"]
["58-0812-2617",null,"20-1039-0004"]
["58-0828-1690",null,"20-1039-0005"]
["58-0832-3816",null,"20-1039-0006"]
["58-0833-0989",null,"20-1055-2097"]
["58-0833-3317",null,"20-1055-2098"]
["58-0833-3816",null,"20-1064-0104"]
["58-0833-3817",null,"20-1064-0105"]
["58-0834-2617",null,"20-1094-0727"]
["58-0834-3317",null,"20-1095-2566"]
["58-0836-2190",null,"20-1095-2567"]
["58-0836-2191",null,"20-1097-2832"]
["58-0837-2190",null,"20-1103-2097"]
["58-0850-1691",null,"20-1107-0265"]
["58-0851-3317",null,"20-1107-0266"]
["58-0851-3318",null,"20-1108-0256"]
["58-0862-2617",null,"20-1108-0257"]
["58-0863-2617",null,"20-1108-0258"]
["58-0869-1990",null,"20-1108-0266"]
["58-0869-1991",null,"20-1108-0364"]
["58-0871-3816",null,"20-1108-0365"]
["58-0872-0288",null,"20-1108-0529"]
["58-0872-0289",null,"20-1108-0530"]
["58-0880-3517",null,"20-1113-0396"]
["58-0889-0990",null,"20-1113-0397"]
["58-0890-2191",null,"20-1145-0698"]
["58-0896-0990",null,"20-1145-0699"]
["58-0902-2192",null,"20-1157-0505"]
["58-0905-2495",null,"20-1157-0506"]
["58-0907-2499",null,"20-1184-2398"]
["58-0910-3517",null,"20-1184-2399"]
["58-0915-2509",null,"20-1194-0839"]
["58-0917-2510",null,"20-1194-0840"]
["58-0922-2192",null,"20-1195-1824"]
["58-0935-4017",null,"20-1195-2425"]
["58-0935-4018",null,"20-1245-0206"]
["58-0936-0289",null,"20-1245-0207"]
["58-0942-1692",null,"20-1267-2297"]
["58-0944-1291",null,"20-1277-2697"]
["58-0946-3816",null,"20-1278-2697"]
["58-0948-0289",null,"20-1288-0006"]
["58-0948-0290",null,"20-1288-0877"]
["58-0948-1992",null,"20-1288-0878"]
["58-0949-2192",null,"20-1288-0879"]
["58-0950-3518",null,"20-1288-0880"]
["58-0950-3579",null,"20-1289-1244"]
["58-0950-3681",null,"20-1349-1996"]
["58-0951-3317",null,"20-1349-1997"]
["58-0951-3813",null,"20-1355-2297"]
["58-0951-3814",null,"20-1355-2298"]
["58-0951-3815",null,"20-1358-2496"]
["58-0951-3816",null,"20-1384-1996"]
["58-0951-3817",null,"20-1384-1997"]
["58-0951-3955",null,"20-1385-1996"]
["58-0951-3956",null,"20-1388-1108"]
["58-0963-4017",null,"20-1391-2101"]
["58-0963-4018",null,"20-1393-2337"]
["58-0969-3322",null,"20-1393-2338"]
["58-0974-1693",null,"20-1394-2498"]
["58-0980-0290",null,"20-1394-2614"]
["58-0985-1993",null,"20-1395-2721"]
["58-0989-3817",null,"20-1402-1796"]
["58-0996-3329",null,"20-1424-1796"]
["58-1005-1292",null,"20-1425-2096"]
["58-1020-3817",null,"20-1425-2097"]
["58-1033-1293",null,"20-1425-2098"]
["58-1036-3817",null,"20-1444-2398"]
["58-1042-0291",null,"20-1444-2399"]
["58-1045-3817",null,"20-1465-2496"]
["58-1058-3918",null,"20-1469-2697"]
["58-1064-1293",null,"20-1469-2698"]
["58-1069-2195",null,"20-1484-1795"]
["58-1069-3518",null,"20-1485-1795"]
["58-1080-2195",null,"20-1485-1796"]
["58-1083-0893",null,"20-1493-2496"]
["58-1083-0894",null,"20-1493-2597"]
["58-1085-0893",null,"20-1493-2598"]
["58-1098-1654",null,"20-1494-2496"]
["58-1098-1693",null,"20-1494-2595"]
["58-1099-0292",null,"20-1494-2596"]
["58-1105-2202",null,"20-1495-2696"]
["58-1108-3518",null,"20-1495-2697"]
["58-1128-1695",null,"20-1495-2758"]
["58-1128-1696",null,"20-1495-2759"]
["58-1129-3918",null,"20-1495-2802"]
["58-1135-1294",null,"20-1503-0080"]
["58-1139-1294",null,"20-1506-0425"]
["58-1145-1595",null,"20-1507-0505"]
["58-1145-1596",null,"20-1512-2697"]
["58-1150-2578",null,"20-1523-0406"]
["58-1150-2599",null,"20-1551-0206"]
["58-1175-3219",null,"20-1554-0406"]
["58-1178-2196",null,"20-1585-2297"]
["58-1183-2820",null,"20-1585-2497"]
["58-1187-3919",null,"20-1586-2297"]
["58-1188-0894",null,"20-1586-2497"]
["58-1196-1371",null,"20-1589-1895"]
["58-1196-1396",null,"20-1592-2225"]
["58-1197-1419",null,"20-1592-2226"]
["58-1197-1444",null,"20-1592-2227"]
["58-1197-1445",null,"20-1592-2228"]
["58-1197-1475",null,"20-1592-2270"]
["58-1198-1594",null,"20-1592-2271"]
["58-1207-0894",null,"20-1594-2621"]
["58-1207-0895",null,"20-1595-2753"]
["58-1211-3519",null,"20-1595-2754"]
["58-1211-3520",null,"20-1595-2755"]
["58-1213-1696",null,"20-1612-2297"]
["58-1225-0294",null,"20-1613-2297"]
["58-1229-1296",null,"20-1613-2298"]
["58-1244-3919",null,"20-1626-1794"]
["58-1245-3919",null,"20-1629-0605"]
["58-1246-3919",null,"20-1629-2698"]
["58-1261-2197",null,"20-1646-2096"]
["58-1276-3220",null,"20-1659-0205"]
["58-1280-3520",null,"20-1660-0206"]
["58-1281-0294",null,"20-1661-0505"]
["58-1282-1295",null,"20-1687-0639"]
["58-1288-2198",null,"20-1687-0736"]
["58-1291-0028",null,"20-1702-1395"]
["58-1292-0120",null,"20-1703-0132"]
["58-1292-0219",null,"20-1703-0133"]
["58-1292-0319",null,"20-1703-1394"]
["58-1292-0381",null,"20-1704-0245"]
["58-1293-0467",null,"20-1704-0246"]
["58-1293-0538",null,"20-1704-0253"]
["58-1293-0632",null,"20-1705-0253"]
["58-1293-0633",null,"20-1705-0254"]
["58-1293-0684",null,"20-1705-0298"]
["58-1293-0703",null,"20-1706-0298"]
["58-1294-0856",null,"20-1706-0299"]
["58-1294-0924",null,"20-1709-0605"]
["58-1294-0995",null,"20-1713-0405"]
["58-1295-1123",null,"20-1741-2396"]
["58-1296-1291",null,"20-1742-2396"]
["58-1297-1802",null,"20-1742-2397"]
["58-1298-1293",null,"20-1787-1210"]
["58-1299-1294",null,"20-1787-1211"]
["58-1299-1295",null,"20-1788-1519"]
["58-1299-1935",null,"20-1788-1520"]
["58-1299-2093",null,"20-1788-1547"]
["58-1300-2167",null,"20-1789-1547"]
["58-1300-2195",null,"20-1790-0613"]
["58-1304-2821",null,"20-1793-2609"]
["58-1306-2099",null,"20-1795-0104"]
["58-1310-1296",null,"20-1796-0104"]
["58-1318-3220",null,"20-1801-0104"]
["58-1334-3220",null,"20-1801-0105"]
["58-1338-0295",null,"20-1802-0102"]
["58-1344-2764",null,"20-1802-0103"]
["58-1344-2789",null,"20-1805-1493"]
["58-1344-2834",null,"20-1805-1494"]
["58-1345-2547",null,"20-1813-0794"]
["58-1345-2591",null,"20-1819-1194"]
["58-1345-2628",null,"20-1819-1195"]
["58-1345-2675",null,"20-1848-1393"]
["58-1345-2720",null,"20-1848-1394"]
["58-1346-3038",null,"20-1873-0793"]
["58-1346-3116",null,"20-1885-0405"]
["58-1346-3132",null,"20-1890-1965"]
["58-1346-3133",null,"20-1893-2645"]
["58-1346-3134",null,"20-1893-2646"]
["58-1348-2099",null,"20-1893-2647"]
["58-1370-1700",null,"20-1904-0255"]
["58-1376-0797",null,"20-1904-0256"]
["58-1393-0797",null,"20-1905-0520"]
["58-1401-2276",null,"20-1905-0521"]
["58-1401-2290",null,"20-1905-0522"]
["58-1403-1701",null,"20-1905-0547"]
["58-1420-3521",null,"20-1905-0601"]
["58-1429-3920",null,"20-1905-1392"]
["58-1433-3121",null,"20-1905-1393"]
["58-1437-2200",null,"20-1905-1394"]
["58-1437-2201",null,"20-1936-0792"]
["58-1445-2402",null,"20-1947-2898"]
["58-1445-2493",null,"20-1947-2899"]
["58-1446-2462",null,"20-1949-1996"]
["58-1446-2463",null,"20-1958-1693"]
["58-1449-1702",null,"20-1987-1378"]
["58-1451-3521",null,"20-1988-1378"]
["58-1453-3521",null,"20-1988-1379"]
["58-1461-1301",null,"20-1994-2807"]
["58-1493-2202",null,"20-2004-0506"]
["58-1494-3920",null,"20-2005-0605"]
["58-1509-2203",null,"20-2005-0606"]
["58-1520-0800",null,"20-2005-0607"]
["58-1520-0801",null,"20-2027-2698"]
["58-1520-0802",null,"20-2027-2699"]
["58-1529-2203",null,"20-2056-0405"]
["58-1529-2204",null,"20-2056-0406"]
["58-1529-3121",null,"20-2126-2096"]
["58-1530-2203",null,"20-2132-2081"]
["58-1534-3520",null,"20-2132-2082"]
["58-1538-0300",null,"20-2132-2083"]
["58-1545-3921",null,"20-2133-2080"]
["58-1546-2411",null,"20-2133-2140"]
["58-1546-2435",null,"20-2133-2141"]
["58-1547-3345",null,"20-2133-2142"]
["58-1547-3406",null,"20-2133-2196"]
["58-1548-3520",null,"22-0031-0593"]
["58-1548-3521",null,"22-0076-0693"]
["58-1549-3748",null,"22-0076-0694"]
["58-1549-4133",null,"22-0076-0695"]
["58-1549-4153",null,"22-0076-0696"]
["58-1549-4179",null,"22-0098-0131"]
["58-1550-3934",null,"22-0296-0098"]
["58-1550-4012",null,"22-0393-0090"]
["58-1554-2405",null,"22-0393-0091"]
["58-1558-3121",null,"22-0593-0058"]
["58-1569-0800",null,"22-0692-0058"]
["58-1570-0800",null,"22-0791-0010"]
["58-1579-2405",null,"22-0988-0032"]
["58-1580-3921",null,"22-0990-0254"]
["58-1581-0301",null,"22-1038-0196"]
["58-1588-1705",null,"22-1089-0196"]
["58-1591-0202",null,"22-1317-0876"]
["58-1591-0218",null,"22-1389-0485"]
["58-1592-0342",null,"22-1406-0748"]
["58-1592-0343",null,"22-1408-0888"]
["58-1592-0367",null,"22-1409-0888"]
["58-1592-0488",null,"22-1514-0888"]
["58-1592-0503",null,"22-1517-1453"]
["58-1592-0532",null,"22-1517-1454"]
["58-1592-0533",null,"22-1583-0591"]
["58-1592-0578",null,"22-1682-0099"]
["58-1592-0596",null,"22-1682-0100"]
["58-1593-0761",null,"22-1682-0101"]
["58-1593-1095",null,"22-1685-0219"]
["58-1594-1138",null,"22-1685-0220"]
["58-1594-1305",null,"22-1783-0075"]
["58-1595-1329",null,"22-1784-0230"]
["58-1595-1379",null,"22-1901-0595"]
["58-1595-1380",null,"22-1901-0596"]
["58-1596-0444",null,"22-1917-1547"]
["58-1596-1304",null,"22-1917-1548"]
["58-1596-1416",null,"22-1918-1547"]
["58-1596-1649",null,"22-1933-1495"]
["58-1597-3121",null,"22-1933-1496"]
["58-1598-1880",null,"22-1979-0014"]
["58-1599-1922",null,"22-1979-0015"]
["58-1599-2007",null,"22-1983-0240"]
["58-1599-2058",null,"22-1983-0263"]
["58-1599-2205",null,"22-1986-0711"]
["58-1600-2205",null,"22-2079-0047"]
["58-1600-2251",null,"22-2079-0048"]
["58-1600-2253",null,"22-2079-0049"]
["58-1600-2277",null,"22-2082-0999"]
["58-1602-2389",null,"22-2082-1000"]
["58-1606-3521",null,"22-2082-1001"]
["58-1612-0802",null,"22-2082-1002"]
["58-1614-0301",null,"22-2113-1046"]
["58-1635-3322",null,"22-2113-1047"]
["58-1636-3321",null,"22-2118-1120"]
["58-1641-0302",null,"22-2118-1172"]
["58-1643-2615",null,"22-2118-1173"]
["58-1644-2728",null,"22-2170-1398"]
["58-1644-2818",null,"22-2177-0395"]
["58-1644-2820",null,"22-2179-1398"]
["58-1644-2946",null,"22-2180-1398"]
["58-1644-3000",null,"22-2180-1399"]
["58-1644-3521",null,"22-2283-0580"]
["58-1645-3048",null,"22-2283-0581"]
["58-1646-3189",null,"22-2284-0694"]
["58-1647-3314",null,"22-2284-0695"]
["58-1650-0201",null,"22-2287-1498"]
["58-1651-1305",null,"22-2287-1499"]
["58-1679-3121",null,"22-2294-0827"]
["58-1681-3121",null,"22-2302-0695"]
["58-1684-3922",null,"22-2303-0595"]
["58-1689-0202",null,"22-2307-0997"]
["58-1690-0014",null,"22-2316-1504"]
["58-1692-3521",null,"22-2316-1505"]
["58-1693-0302",null,"22-2319-0695"]
["58-1693-0303",null,"22-2353-1498"]
["58-1697-2108",null,"22-2361-0899"]
["58-1697-2109",null,"22-2412-1697"]
["58-1697-2110",null,"22-2412-1698"]
["58-1697-2111",null,"22-2415-1755"]
["58-1702-1306",null,"22-2415-1756"]
["58-1718-3522",null,"22-2415-1757"]
["58-1736-0804",null,"22-2436-1398"]
["58-1764-3923",null,"22-2437-1398"]
["58-1765-2109",null,"22-2470-1496"]
["58-1780-3121",null,"22-2475-1496"]
["58-1802-2110",null,"22-2475-1497"]
["58-1806-3522",null,"22-2486-0698"]
["58-1844-3522",null,"22-2490-1001"]
["58-1847-2110",null,"22-2501-0850"]
["58-1847-3121",null,"22-2501-0851"]
["58-1853-1709",null,"22-2502-0900"]
["58-1867-0806",null,"22-2502-0901"]
["58-1867-2111",null,"22-2506-0900"]
["58-1868-3522",null,"22-2507-1328"]
["58-1890-0081",null,"22-2507-1329"]
["58-1890-0123",null,"22-2509-1086"]
["58-1890-0124",null,"22-2509-1087"]
["58-1890-0125",null,"22-2509-1423"]
["58-1890-0151",null,"22-2509-1424"]
["58-1890-0274",null,"22-2509-1425"]
["58-1890-0358",null,"22-2509-1427"]
["58-1890-0768",null,"22-2509-1428"]
["58-1891-0305",null,"22-2520-1395"]
["58-1892-1084",null,"22-2523-1697"]
["58-1892-1121",null,"22-2524-1697"]
["58-1892-1199",null,"22-2541-1295"]
["58-1893-1301",null,"22-2542-1295"]
["58-1895-1512",null,"22-2544-0698"]
["58-1895-1579",null,"22-2577-0086"]
["58-1895-1600",null,"22-2579-1295"]
["58-1897-2111",null,"22-2580-1295"]
["58-1916-1509",null,"22-2602-1270"]
["58-1919-0015",null,"22-2603-1269"]
["58-1925-3522",null,"22-2603-1270"]
["58-1933-2576",null,"22-2603-1271"]
["58-1933-2654",null,"22-2611-1707"]
["58-1934-0305",null,"22-2611-1708"]
["58-1934-0306",null,"22-2611-1709"]
["58-1934-2560",null,"22-2612-1728"]
["58-1938-1309",null,"22-2612-1729"]
["58-1943-1007",null,"22-2612-1730"]
["58-1944-3922",null,"22-2661-0102"]
["58-1961-1309",null,"22-2661-0103"]
["58-1969-0016",null,"22-2661-0104"]
["58-1969-1007",null,"22-2672-1894"]
["58-1970-1007",null,"22-2672-1895"]
["58-1988-3922",null,"22-2678-0127"]
["58-1990-1309",null,"22-2678-0128"]
["58-1991-0865",null,"22-2680-0398"]
["58-1991-0866",null,"22-2702-1254"]
["58-1991-3522",null,"22-2733-1294"]
["58-1995-1729",null,"22-2743-1894"]
["58-1995-1749",null,"22-2744-1894"]
["58-1996-1817",null,"22-2795-1993"]
["58-1997-1933",null,"22-2809-1618"]
["58-1998-2012",null,"22-2809-1619"]
["58-1999-2156",null,"22-2852-0399"]
["58-1999-2173",null,"22-2883-0376"]
["58-1999-2191",null,"22-2891-0759"]
["58-2000-2227",null,"22-2891-0760"]
["58-2000-2334",null,"22-2891-0761"]
["58-2008-3522",null,"22-2892-0805"]
["58-2023-3122",null,"22-2898-1992"]
["58-2024-3122",null,"22-2916-1892"]
["58-2026-3208",null,"22-2970-0018"]
["58-2028-3521",null,"22-2970-0019"]
["58-2033-2575",null,"22-2985-0546"]
["58-2033-2670",null,"22-2985-0547"]
["58-2034-0305",null,"22-2989-0758"]
["58-2034-2549",null,"22-2989-0759"]
["58-2034-2732",null,"22-2989-0760"]
["58-2034-2780",null,"22-2989-0761"]
["58-2035-2472",null,"22-2991-1892"]
["58-2035-2855",null,"22-3005-1581"]
["58-2037-2953",null,"22-3010-1938"]
["58-2040-3114",null,"22-3010-1939"]
["58-2040-3130",null,"22-3010-1979"]
["58-2041-3275",null,"22-3010-2035"]
["58-2041-3287",null,"23-0321-0400"]
["58-2041-3300",null,"23-0600-2150"]
["58-2041-3333",null,"23-0600-2153"]
["58-2041-3392",null,"23-0660-1902"]
["58-2042-3418",null,"23-0899-1839"]
["58-2042-3492",null,"23-1396-1146"]
["58-2043-3589",null,"23-1711-1202"]
["58-2043-3737",null,"23-1838-1803"]
["58-2043-3823",null,"23-1868-1202"]
["58-2044-3122",null,"23-1870-1202"]
["58-2044-3921",null,"23-1991-0615"]
["58-2044-3922",null,"23-1992-0650"]
["58-2044-3970",null,"23-2020-1704"]
["58-2044-3980",null,"23-2294-1384"]
["58-2044-4014",null,"23-2314-1205"]
["58-2045-4014",null,"23-2327-1204"]
["58-2056-2012",null,"23-2393-0992"]
["58-2057-0305",null,"23-2551-1104"]
["58-2057-0306",null,"23-2592-0903"]
["58-2060-1510",null,"23-2789-0885"]
["58-2065-0016",null,"23-2795-1305"]
["58-2066-3423",null,"23-2795-1738"]
["58-2069-0306",null,"23-2800-1305"]
["58-2070-3922",null,"23-2892-1319"]
["58-2076-1008",null,"23-2892-1388"]
["58-2081-3423",null,"23-2894-1546"]
["58-2087-2822",null,"23-2985-0264"]
["58-2095-0016",null,"23-2988-0810"]
["58-2101-1008",null,"23-2988-0812"]
["58-2101-3423",null,"23-2988-0834"]
["58-2110-2822",null,"23-2991-1142"]
["58-2122-0306",null,"23-3095-1545"]
["58-2127-0016",null,"23-3096-1098"]
["58-2132-1311",null,"23-3096-1288"]
["58-2141-2822",null,"23-3096-1348"]
["58-2142-2013",null,"23-3097-1865"]
["58-2142-3423",null,"23-3104-1104"]
["58-2142-3424",null,"23-3188-0204"]
["58-2145-3123",null,"23-3192-0138"]
["58-2145-3124",null,"23-3193-0201"]
["58-2145-3125",null,"23-3195-1221"]
["58-2145-3126",null,"23-3196-1284"]
["58-2145-3127",null,"23-3196-1612"]
["58-2145-3128",null,"23-3198-0205"]
["58-2151-3423",null,"23-3392-0067"]
["58-2169-3922",null,"23-3392-0122"]
["58-2176-1008",null,"23-3394-0613"]
["58-2189-0506",null,"23-3394-0616"]
["58-2189-0529",null,"23-3395-0948"]
["58-2190-0064",null,"23-3395-0952"]
["58-2190-0133",null,"23-3395-1249"]
["58-2190-0182",null,"23-3396-2017"]
["58-2190-0242",null,"23-3421-2008"]
["58-2190-0307",null,"23-3438-1507"]
["58-2191-0728",null,"23-3450-2107"]
["58-2191-0776",null,"23-3457-1107"]
["58-2191-3123",null,"23-3465-2007"]
["58-2192-0923",null,"23-3466-1307"]
["58-2192-0982",null,"23-3487-1908"]
["58-2193-1197",null,"23-3495-0897"]
["58-2193-1210",null,"23-3495-1153"]
["58-2201-1511",null,"23-3495-1661"]
["58-2202-1311",null,"23-3496-1314"]
["58-2204-3423",null,"23-3496-1555"]
["58-2205-3423",null,"23-3497-2205"]
["58-2220-3123",null,"23-3498-0806"]
["58-2222-1311",null,"23-3501-0906"]
["58-2236-1311",null,"23-3588-0206"]
["58-2236-1312",null,"23-3591-0109"]
["58-2244-3922",null,"23-3591-0151"]
["58-2259-3123",null,"23-3592-0215"]
["58-2261-0909",null,"23-3592-0402"]
["58-2267-3423",null,"23-3695-1011"]
["58-2278-1312",null,"23-3702-1107"]
["58-2293-1312",null,"23-3834-2007"]
["58-2293-1512",null,"23-3942-1107"]
["58-2298-2013",null,"23-3963-0907"]
["58-2317-3923",null,"23-3994-0457"]
["58-2317-3924",null,"23-4019-1508"]
["58-2324-3423",null,"23-4207-1609"]
["58-2328-3123",null,"23-4214-2009"]
["58-2329-3123",null,"23-4267-1910"]
["58-2334-3923",null,"23-4281-0703"]
["58-2340-3423",null,"23-4288-0708"]
["58-2344-3423",null,"23-4386-1121"]
["58-2344-3424",null,"23-4388-0709"]
["58-2345-3423",null,"23-4601-2120"]
["58-2358-3923",null,"23-4620-1513"]
["58-2379-0018",null,"23-4697-2042"]
["58-2382-0307",null,"25-0917-0501"]
["58-2385-0018",null,"25-0929-0501"]
["58-2394-1311",null,"25-0967-0501"]
["58-2396-1970",null,"25-1495-1333"]
["58-2397-2042",null,"25-1791-0330"]
["58-2397-2106",null,"25-1990-0312"]
["58-2399-2294",null,"25-2097-1714"]
["58-2405-3423",null,"25-2290-0406"]
["58-2405-3424",null,"25-2299-2256"]
["58-2451-3423",null,"25-2300-2269"]
["58-2477-1313",null,"25-2300-2349"]
["58-2487-0609",null,"25-2369-2333"]
["58-2487-0611",null,"25-2412-1607"]
["58-2488-0661",null,"25-2489-0438"]
["58-2489-0739",null,"25-2497-1928"]
["58-2489-0845",null,"25-2497-1988"]
["58-2490-0911",null,"25-2586-1707"]
["58-2490-1010",null,"25-2589-0453"]
["58-2491-1262",null,"25-2590-0827"]
["58-2496-1614",null,"25-2596-1815"]
["58-2501-3423",null,"25-2596-1934"]
["58-2521-0912",null,"25-2599-2318"]
["58-2534-2015",null,"25-2609-2307"]
["58-2544-1314",null,"25-2795-1738"]
["58-2545-1314",null,"25-2795-1758"]
["58-2551-2823",null,"25-2796-1845"]
["58-2551-2824",null,"25-2796-1853"]
["58-2551-2825",null,"25-2798-2218"]
["58-2552-2823",null,"25-2856-1207"]
["58-2587-2016",null,"25-2874-1207"]
["58-2598-3423",null,"25-2889-0743"]
["58-2628-1616",null,"25-2890-0898"]
["58-2628-2017",null,"25-2955-0505"]
["58-2641-3924",null,"25-2955-0506"]
["58-2654-3423",null,"25-2988-0369"]
["58-2669-3423",null,"25-3012-0305"]
["58-2669-3424",null,"25-3025-1807"]
["58-2689-0213",null,"25-3105-1707"]
["58-2691-1025",null,"25-3223-1707"]
["58-2691-1192",null,"25-3270-1607"]
["58-2693-0020",null,"25-3293-1613"]
["58-2700-1317",null,"25-3495-2016"]
["58-2710-0213",null,"25-3496-2015"]
["58-2725-3424",null,"25-3557-0206"]
["58-2726-3424",null,"25-3651-2108"]
["58-2732-2436",null,"25-3688-0807"]
["58-2732-2469",null,"25-3690-1761"]
["58-2732-2522",null,"25-3750-0508"]
["58-2732-2573",null,"25-3789-1391"]
["58-2732-2596",null,"25-3879-1197"]
["58-2732-2606",null,"25-3948-0907"]
["58-2732-2670",null,"25-3949-0373"]
["58-2733-2667",null,"25-3950-0907"]
["58-2733-2668",null,"25-3959-0707"]
["58-2733-2669",null,"25-3965-0507"]
["58-2733-2670",null,"25-3972-0593"]
["58-2733-2671",null,"25-3979-0563"]
["58-2733-2672",null,"25-3994-2174"]
["58-2733-2673",null,"25-4010-1211"]
["58-2733-2678",null,"25-4193-2158"]
["58-2733-2703",null,"26-0137-0606"]
["58-2733-2704",null,"26-0201-0950"]
["58-2733-2706",null,"26-0202-0825"]
["58-2733-2710",null,"26-0276-0605"]
["58-2733-2723",null,"26-0300-0505"]
["58-2733-2776",null,"26-0343-1210"]
["58-2733-2804",null,"26-0345-0808"]
["58-2734-2926",null,"26-0373-1210"]
["58-2734-2927",null,"26-0385-0808"]
["58-2734-2928",null,"26-0400-0524"]
["58-2734-3045",null,"26-0406-0808"]
["58-2734-3159",null,"26-0438-0908"]
["58-2734-3210",null,"26-0457-1210"]
["58-2735-3266",null,"26-0501-0468"]
["58-2735-3267",null,"26-0501-0869"]
["58-2737-3456",null,"26-0523-1110"]
["58-2738-3578",null,"26-0566-0608"]
["58-2738-3614",null,"26-0590-0809"]
["58-2738-3637",null,"26-0701-0810"]
["58-2738-3638",null,"26-0702-0502"]
["58-2739-3719",null,"26-0702-0942"]
["58-2739-3727",null,"26-0706-0810"]
["58-2739-3753",null,"26-0706-0811"]
["58-2740-3835",null,"26-0753-1216"]
["58-2740-3924",null,"26-0753-1217"]
["58-2740-3925",null,"26-0800-0739"]
["58-2742-4094",null,"26-0803-0953"]
["58-2742-4124",null,"26-0821-1117"]
["58-2742-4137",null,"26-0878-1098"]
["58-2778-0916",null,"26-1272-1083"]
["58-2790-0021",null,"26-1357-1220"]
["58-2792-1566",null,"26-1368-0616"]
["58-2792-1567",null,"26-1372-0588"]
["58-2792-1570",null,"26-1669-0281"]
["58-2792-1572",null,"26-1669-0292"]
["58-2793-1612",null,"26-1669-0961"]
["58-2794-1720",null,"26-1670-0335"]
["58-2794-1752",null,"26-1678-2000"]
["58-2795-1820",null,"26-1678-2104"]
["58-2795-1894",null,"26-1679-2199"]
["58-2795-1942",null,"26-1681-2385"]
["58-2795-2018",null,"26-1738-0206"]
["58-2796-2038",null,"26-1749-0405"]
["58-2796-2068",null,"26-1760-0739"]
["58-2797-2229",null,"26-1761-0847"]
["58-2798-2325",null,"26-1762-0915"]
["58-2810-3925",null,"26-1766-1158"]
["58-2819-0021",null,"26-1769-0551"]
["58-2819-1319",null,"26-1769-0552"]
["58-2824-3925",null,"26-1770-1232"]
["58-2834-0917",null,"26-1852-0505"]
["58-2854-0021",null,"26-1868-0366"]
["58-2868-1320",null,"26-1868-1121"]
["58-2868-1321",null,"26-1869-0498"]
["58-2873-0918",null,"26-1923-0822"]
["58-2873-0919",null,"26-1926-0404"]
["58-2883-2021",null,"26-1960-0698"]
["58-2889-0216",null,"26-1961-0739"]
["58-2891-3425",null,"26-1961-0848"]
["58-2896-1520",null,"26-1967-1297"]
["58-2896-1521",null,"26-1968-0405"]
["58-2899-2725",null,"26-2035-1720"]
["58-2915-2021",null,"26-2060-0690"]
["58-2920-3425",null,"26-2061-0775"]
["58-2931-1521",null,"26-2065-1326"]
["58-2931-1522",null,"26-2066-1328"]
["58-2931-2725",null,"26-2067-1441"]
["58-2931-2726",null,"26-2087-1477"]
["58-2932-1521",null,"26-2115-1124"]
["58-2941-1521",null,"26-2164-1050"]
["58-2959-1321",null,"26-2166-0280"]
["58-2975-2725",null,"26-2173-1818"]
["58-2977-3426",null,"26-2175-1981"]
["58-2983-1521",null,"26-2190-1125"]
["58-2983-1522",null,"26-2196-1723"]
["58-3003-2023",null,"26-2316-2124"]
["58-3014-0218",null,"26-2352-1824"]
["58-3018-3426",null,"26-2359-1235"]
["58-3021-1321",null,"26-2361-1353"]
["58-3024-1321",null,"26-2362-1420"]
["58-3031-2452",null,"26-2366-1724"]
["58-3031-2484",null,"26-2367-0470"]
["58-3031-2505",null,"26-2367-0471"]
["58-3031-2607",null,"26-2367-0590"]
["58-3031-2623",null,"26-2368-1799"]
["58-3031-2646",null,"26-2445-1423"]
["58-3032-2705",null,"26-2460-0779"]
["58-3032-2756",null,"26-2460-0876"]
["58-3032-2786",null,"26-2465-1616"]
["58-3032-2822",null,"26-2465-1653"]
["58-3032-2829",null,"26-2467-1755"]
["58-3032-2889",null,"26-2473-0005"]
["58-3032-2931",null,"26-2477-2020"]
["58-3033-3060",null,"26-2480-0004"]
["58-3033-3123",null,"26-2517-0504"]
["58-3034-3155",null,"26-2554-1822"]
["58-3034-3196",null,"26-2560-1623"]
["58-3034-3197",null,"26-2564-1537"]
["58-3034-3210",null,"26-2565-1616"]
["58-3034-3218",null,"26-2566-1669"]
["58-3034-3226",null,"26-2567-1800"]
["58-3034-3249",null,"26-2568-1723"]
["58-3035-3284",null,"26-2615-1622"]
["58-3035-3321",null,"26-2629-0504"]
["58-3035-3390",null,"26-2651-0803"]
["58-3036-3434",null,"26-2653-2319"]
["58-3036-3510",null,"26-2662-1508"]
["58-3037-3582",null,"26-2667-0011"]
["58-3037-3639",null,"26-2684-1020"]
["58-3038-3725",null,"26-2704-1029"]
["58-3039-3726",null,"26-2704-2415"]
["58-3039-3898",null,"26-2704-2416"]
["58-3040-3952",null,"26-2704-2417"]
["58-3040-3972",null,"26-2704-2418"]
["58-3040-4014",null,"26-2704-2419"]
["58-3040-4024",null,"26-2714-0503"]
["58-3040-4047",null,"26-2742-1420"]
["58-3041-4107",null,"26-2754-1048"]
["58-3041-4125",null,"26-2765-0229"]
["58-3041-4127",null,"26-2765-0517"]
["58-3042-4204",null,"26-2765-1664"]
["58-3054-3727",null,"26-2766-1621"]
["58-3067-2023",null,"26-2766-1754"]
["58-3070-0620",null,"26-2768-1914"]
["58-3071-2926",null,"26-2769-2025"]
["58-3072-2926",null,"26-2817-0502"]
["58-3072-2927",null,"26-2877-1019"]
["58-3077-0022",null,"26-2883-1019"]
["58-3088-1321",null,"26-2895-0501"]
["58-3091-0219",null,"26-2900-1819"]
["58-3091-1321",null,"26-2926-2319"]
["58-3095-0022",null,"26-2932-0501"]
["58-3096-2926",null,"26-2953-1292"]
["58-3117-3426",null,"26-2954-0939"]
["58-3118-0620",null,"26-2954-2418"]
["58-3119-1321",null,"26-2961-1859"]
["58-3122-3029",null,"26-2962-1999"]
["58-3131-2024",null,"26-2965-0502"]
["58-3131-2025",null,"26-2965-0503"]
["58-3132-3080",null,"26-2965-2158"]
["58-3132-3123",null,"26-2969-2302"]
["58-3138-3727",null,"26-2970-1619"]
["58-3147-3426",null,"26-2970-2409"]
["58-3177-2024",null,"26-2970-2412"]
["58-3178-1322",null,"26-2981-0501"]
["58-3181-0220",null,"26-3008-0818"]
["58-3183-2926",null,"26-3066-1219"]
["58-3183-3426",null,"26-3152-2316"]
["58-3184-2926",null,"26-3154-1159"]
["58-3184-2927",null,"26-3155-0737"]
["58-3188-0621",null,"26-3158-1691"]
["58-3204-3125",null,"26-3160-0817"]
["58-3215-0023",null,"26-3160-0818"]
["58-3222-1323",null,"26-3162-0359"]
["58-3228-3426",null,"26-3163-0402"]
["58-3231-0221",null,"26-3163-2119"]
["58-3239-3926",null,"26-3167-2303"]
["58-3239-3928",null,"26-3273-2317"]
["58-3239-4012",null,"26-3308-0403"]
["58-3240-0023",null,"26-3310-1817"]
["58-3240-4038",null,"26-3348-2116"]
["58-3240-4148",null,"26-3354-0827"]
["58-3240-4149",null,"26-3355-1589"]
["58-3241-3896",null,"26-3363-0548"]
["58-3241-3899",null,"26-3363-2069"]
["58-3241-4226",null,"26-3422-0915"]
["58-3247-1323",null,"26-3422-0916"]
["58-3259-3125",null,"26-3453-0934"]
["58-3260-0221",null,"26-3453-0935"]
["58-3265-2926",null,"26-3455-1585"]
["58-3267-3426",null,"26-3551-1296"]
["58-3281-1323",null,"26-3552-0895"]
["58-3283-0058",null,"26-3552-0896"]
["58-3284-0102",null,"26-3553-1527"]
["58-3284-0103",null,"26-3723-0375"]
["58-3284-0129",null,"26-3757-1788"]
["58-3284-0161",null,"26-3783-2246"]
["58-3284-0191",null,"27-0024-1488"]
["58-3284-0208",null,"27-0065-1586"]
["58-3284-0249",null,"27-0084-0688"]
["58-3284-0314",null,"27-0129-1088"]
["58-3285-0391",null,"27-0189-1587"]
["58-3285-0423",null,"27-0200-1167"]
["58-3285-0435",null,"27-0200-1168"]
["58-3286-0480",null,"27-0201-1330"]
["58-3287-0621",null,"27-0216-0088"]
["58-3287-0623",null,"27-0221-1187"]
["58-3287-0638",null,"27-0223-0288"]
["58-3287-0639",null,"27-0298-1088"]
["58-3288-0670",null,"27-0299-1477"]
["58-3288-0761",null,"27-0305-1287"]
["58-3289-0817",null,"27-0399-0934"]
["58-3289-0858",null,"27-0400-1231"]
["58-3289-0859",null,"27-0430-0987"]
["58-3289-2026",null,"27-0437-1587"]
["58-3289-2027",null,"27-0448-1288"]
["58-3289-2028",null,"27-0598-1048"]
["58-3290-1332",null,"27-0667-0214"]
["58-3290-1333",null,"27-0675-2886"]
["58-3290-1334",null,"27-0801-2806"]
["58-3291-1481",null,"27-0915-2885"]
["58-3291-1583",null,"27-1066-2786"]
["58-3291-1633",null,"27-2713-3085"]
["58-3292-1824",null,"27-2789-2953"]
["58-3292-2926",null,"27-2789-3063"]
["58-3293-1901",null,"27-2790-3185"]
["58-3294-2003",null,"27-2796-2984"]
["58-3294-2035",null,"27-2797-2984"]
["58-3294-2043",null,"27-2822-3085"]
["58-3294-2052",null,"27-2913-2884"]
["58-3294-2053",null,"27-2955-2645"]
["58-3294-2054",null,"27-3014-3084"]
["58-3294-3126",null,"27-3288-3167"]
["58-3295-0221",null,"27-3289-3374"]
["58-3295-2926",null,"27-3289-3375"]
["58-3296-2238",null,"27-3332-3180"]
["58-3296-2268",null,"29-0102-1176"]
["58-3296-2926",null,"29-0103-0028"]
["58-3297-2356",null,"29-0130-0003"]
["58-3297-2390",null,"29-0206-0003"]
["58-3301-1871",null,"29-0301-1188"]
["58-3304-1865",null,"29-0378-1203"]
["58-3305-3426",null,"29-0401-0123"]
["58-3317-1846",null,"29-0437-1203"]
["58-3317-1847",null,"29-0466-1203"]
["58-3324-1324",null,"29-0486-1602"]
["58-3326-2484",null,"29-0501-0150"]
["58-3326-2485",null,"29-0501-0542"]
["58-3327-2578",null,"29-0651-0205"]
["58-3327-2610",null,"29-0796-1574"]
["58-3328-2687",null,"29-0797-0212"]
["58-3328-2704",null,"29-0797-0677"]
["58-3329-2736",null,"29-0798-0856"]
["58-3330-0222",null,"29-0798-0857"]
["58-3332-3727",null,"29-0817-0905"]
["58-3336-3427",null,"29-0822-0604"]
["58-3347-1324",null,"29-0895-1522"]
["58-3348-0622",null,"29-0896-0741"]
["58-3355-3427",null,"29-0896-0806"]
["58-3359-2826",null,"29-0896-1349"]
["58-3359-2827",null,"29-0896-1418"]
["58-3359-3126",null,"29-0896-1419"]
["58-3362-0222",null,"29-0896-1585"]
["58-3362-0623",null,"29-0916-0805"]
["58-3369-1926",null,"29-0935-1402"]
["58-3370-1926",null,"29-0938-1402"]
["58-3372-0023",null,"29-0973-0905"]
["58-3372-1324",null,"29-0979-1602"]
["58-3374-3126",null,"29-0985-1105"]
["58-3385-1926",null,"29-0986-1105"]
["58-3389-0977",null,"29-1033-0404"]
["58-3390-1138",null,"29-1095-1449"]
["58-3390-1233",null,"29-1095-1451"]
["58-3391-1290",null,"29-1096-0512"]
["58-3391-1291",null,"29-1096-0513"]
["58-3392-1322",null,"29-1096-1719"]
["58-3393-1324",null,"29-1096-1720"]
["58-3396-0222",null,"29-1131-1604"]
["58-3405-0023",null,"29-1195-0568"]
["58-3417-1926",null,"29-1196-1472"]
["58-3418-0023",null,"29-1196-1473"]
["58-3421-3126",null,"29-1196-1474"]
["58-3421-3127",null,"29-1243-0604"]
["58-3428-2826",null,"29-1483-1106"]
["58-3430-2850",null,"29-1484-1106"]
["58-3430-2890",null,"29-1485-1106"]
["58-3430-2906",null,"29-1491-0661"]
["58-3431-2970",null,"29-1491-0662"]
["58-3432-3059",null,"29-1491-1106"]
["58-3432-3075",null,"29-1493-1146"]
["58-3433-3121",null,"29-1494-1144"]
["58-3435-3428",null,"29-1591-0618"]
["58-3447-3427",null,"29-1674-1106"]
["58-3450-1325",null,"29-1691-1093"]
["58-3465-2826",null,"29-1720-1685"]
["58-3472-3427",null,"29-1760-0108"]
["58-3492-1325",null,"29-1867-1506"]
["58-3495-3728",null,"29-1892-1526"]
["58-3509-1927",null,"29-1985-0427"]
["58-3510-1927",null,"29-1991-1266"]
["58-3512-0224",null,"29-2186-0582"]
["58-3512-0225",null,"29-2186-0605"]
["58-3517-2826",null,"29-2186-1022"]
["58-3517-2827",null,"29-2208-0203"]
["58-3522-3126",null,"29-2266-0403"]
["58-3523-3126",null,"29-2321-1103"]
["58-3530-0224",null,"29-2380-0001"]
["58-3538-3754",null,"29-2385-0185"]
["58-3538-3808",null,"29-2386-1012"]
["58-3538-3809",null,"29-2388-1237"]
["58-3538-3844",null,"29-2407-1303"]
["58-3538-3845",null,"29-2407-1304"]
["58-3538-3912",null,"29-2411-0702"]
["58-3539-2826",null,"29-2487-1502"]
["58-3539-3951",null,"29-2487-1518"]
["58-3539-3973",null,"29-2515-1102"]
["58-3539-4044",null,"29-2570-0301"]
["58-3539-4091",null,"29-2586-0994"]
["58-3539-4107",null,"29-2587-0964"]
["58-3540-4227",null,"29-2587-1222"]
["58-3541-3728",null,"29-2641-1102"]
["58-3543-0224",null,"29-2642-1102"]
["58-3543-0225",null,"29-2688-1698"]
["58-3544-0624",null,"29-2689-1803"]
["58-3556-2826",null,"29-2713-1702"]
["58-3575-0625",null,"29-2714-1702"]
["58-3580-2826",null,"29-2722-0901"]
["58-3582-3728",null,"29-2723-0901"]
["58-3585-1326",null,"29-2741-0700"]
["58-3588-3127",null,"29-2748-0800"]
["58-3609-3428",null,"29-2749-0800"]
["58-3622-2827",null,"29-2750-0502"]
["58-3636-4029",null,"29-2761-0700"]
["58-3636-4030",null,"29-2780-1700"]
["58-3636-4031",null,"29-2781-1700"]
["58-3637-4029",null,"29-2783-0529"]
["59-0254-3752",null,"29-2783-0683"]
["59-0293-3153",null,"29-2783-0833"]
["59-0365-3752",null,"29-2783-0834"]
["59-0376-1744",null,"29-2785-1102"]
["59-0408-2544",null,"29-2786-0901"]
["59-0423-3352",null,"29-2786-0902"]
["59-0456-2221",null,"29-2801-0901"]
["59-0456-2730",null,"29-2879-0034"]
["59-0495-3217",null,"29-2879-0035"]
["59-0495-3364",null,"29-2880-0307"]
["59-0536-1544",null,"29-2881-0208"]
["59-0536-1545",null,"29-2887-0300"]
["59-0556-1230",null,"30-0130-3870"]
["59-0556-1238",null,"30-0188-3751"]
["59-0558-1744",null,"30-0225-3600"]
["59-0571-4052",null,"30-0253-4552"]
["59-0626-4052",null,"30-0265-2745"]
["59-0656-1873",null,"30-0278-3585"]
["59-0656-2269",null,"30-0278-4152"]
["59-0656-2416",null,"30-0289-4754"]
["59-0656-2589",null,"30-0320-4752"]
["59-0664-1744",null,"30-0361-4678"]
["59-0924-1744",null,"30-0361-4733"]
["59-0953-1744",null,"30-0378-3154"]
["59-1023-1745",null,"30-0378-3159"]
["59-1352-2897",null,"30-0378-3163"]
["59-1550-3000",null,"30-0378-3192"]
["59-1765-0599",null,"30-0390-3339"]
["59-2219-3917",null,"30-0403-3292"]
["59-2298-3859",null,"30-0430-4699"]
["59-2351-3822",null,"30-0519-4642"]
["59-2463-3723",null,"30-0597-2235"]
["59-2884-3632",null,"30-0605-2316"]
["59-3007-3581",null,"30-0629-4661"]
["59-3344-4012",null,"30-0696-1412"]
["59-3868-4041",null,"30-0696-1414"]
["59-4167-3969",null,"30-0795-2165"]
["59-4203-3969",null,"30-0796-1357"]
["59-4340-3969",null,"30-0797-0986"]
["59-4355-3401",null,"30-0798-2317"]
["59-4553-3969",null,"30-0837-2737"]
["59-4848-4069",null,"30-0859-3440"]
["59-5004-4069",null,"30-0896-0698"]
["59-5160-3884",null,"30-0897-0607"]
["59-5164-3980",null,"30-0898-0382"]
["59-5259-3679",null,"30-0900-0050"]
["63-0091-2084",null,"30-0900-0062"]
["63-0099-0486",null,"30-0931-3438"]
["63-0108-0209",null,"30-0933-1113"]
["63-0117-1958",null,"30-0972-3438"]
["63-0117-1989",null,"30-0996-1188"]
["63-0123-2084",null,"30-0996-2122"]
["63-0169-2084",null,"30-0997-0628"]
["63-0219-2084",null,"30-0998-0474"]
["63-0262-0985",null,"30-1033-4741"]
["63-0280-0485",null,"30-1161-4541"]
["63-0295-0085",null,"30-1196-0805"]
["63-0313-1353",null,"30-1197-0572"]
["63-0314-1511",null,"30-1197-0657"]
["63-0314-1547",null,"30-1197-0658"]
["63-0315-1578",null,"30-1203-3137"]
["63-0315-1689",null,"30-1308-2117"]
["63-0316-1783",null,"30-1321-2449"]
["63-0344-1485",null,"30-1321-2513"]
["63-0376-0485",null,"30-1323-2982"]
["63-0414-1485",null,"30-1324-3241"]
["63-0414-1486",null,"30-1390-0069"]
["63-0419-0085",null,"30-1390-0106"]
["63-0481-1483",null,"30-1393-1288"]
["63-0649-2283",null,"30-1393-2372"]
["63-0676-2283",null,"30-1422-2800"]
["63-0691-0083",null,"30-1422-2880"]
["63-0702-0484",null,"30-1424-3213"]
["63-0703-0078",null,"30-1427-4105"]
["63-0704-0234",null,"30-1475-3038"]
["63-0705-0483",null,"30-1483-2639"]
["63-0706-0837",null,"30-1493-2107"]
["63-0707-1063",null,"30-1501-0210"]
["63-0710-1307",null,"30-1521-2732"]
["63-0711-1717",null,"30-1559-1013"]
["63-0785-1188",null,"30-1719-2445"]
["63-0802-0083",null,"30-1721-2639"]
["63-0807-1950",null,"30-1886-0144"]
["63-0811-1895",null,"30-1993-1760"]
["63-0884-2282",null,"30-2031-2839"]
["63-0923-2282",null,"30-2037-3039"]
["63-0928-2079",null,"30-2052-2839"]
["63-0958-2282",null,"30-2060-2839"]
["63-0967-2080",null,"30-2062-2416"]
["63-1006-1008",null,"30-2070-0208"]
["63-1006-1009",null,"30-2072-2839"]
["63-1006-1029",null,"30-2092-1637"]
["63-1006-1030",null,"30-2114-3249"]
["63-1056-2080",null,"30-2121-1111"]
["63-1081-2281",null,"30-2141-1011"]
["63-1143-2080",null,"30-2180-1010"]
["63-1194-2280",null,"30-2189-0915"]
["63-1206-1083",null,"30-2192-1602"]
["63-1206-1084",null,"30-2192-1614"]
["63-1206-1110",null,"30-2203-3139"]
["63-1206-1111",null,"30-2212-2754"]
["63-1243-2481",null,"30-2213-2667"]
["63-1299-0031",null,"30-2213-3058"]
["63-1299-0043",null,"30-2213-3144"]
["63-1300-0194",null,"30-2220-2839"]
["63-1301-0370",null,"30-2307-0508"]
["63-1303-0525",null,"30-2353-2115"]
["63-1330-1480",null,"30-2399-0508"]
["63-1402-0888",null,"30-2613-2700"]
["63-1403-0983",null,"30-2614-2823"]
["63-1404-1278",null,"30-2614-2886"]
["63-1407-1661",null,"30-2637-2939"]
["63-1436-2279",null,"30-2658-2738"]
["63-1469-0878",null,"30-2689-2403"]
["63-1503-2078",null,"30-2713-2774"]
["63-1504-1177",null,"30-2714-2918"]
["63-1511-2071",null,"30-2802-3739"]
["63-1511-2072",null,"30-2812-2773"]
["63-1514-0178",null,"30-2818-3437"]
["63-1514-0179",null,"30-2820-3439"]
["63-1528-0178",null,"30-2839-3438"]
["63-1560-1978",null,"30-2853-2638"]
["63-1650-0176",null,"30-2913-2695"]
["63-1701-1177",null,"31-0096-1222"]
["63-1733-0376",null,"31-0123-1234"]
["63-1776-1177",null,"31-0176-0720"]
["63-1776-2478",null,"31-0198-0338"]
["63-1847-0075",null,"31-0209-1369"]
["63-1859-0375",null,"31-0209-1370"]
["63-1861-0676",null,"31-0210-1369"]
["63-1862-0676",null,"31-0302-1486"]
["63-1952-2074",null,"31-0319-0822"]
["63-2005-2277",null,"31-0319-0823"]
["63-2009-2277",null,"31-0368-0220"]
["63-2028-0072",null,"31-0398-0799"]
["63-2093-0131",null,"31-0400-0185"]
["63-2093-0451",null,"31-0414-1504"]
["63-2103-1575",null,"31-0423-2427"]
["63-2103-2097",null,"31-0649-0009"]
["63-2217-0672",null,"31-0677-2092"]
["63-2229-2275",null,"31-0686-2127"]
["63-2258-2505",null,"31-0713-2237"]
["63-2263-2574",null,"31-0795-0349"]
["63-2302-1384",null,"31-0798-0774"]
["63-2304-1517",null,"31-0804-0995"]
["63-2312-2106",null,"31-0807-1554"]
["63-2314-1368",null,"31-0807-1555"]
["63-2334-1972",null,"31-0810-1423"]
["63-2379-1973",null,"31-0810-1550"]
["63-2403-1973",null,"31-0818-0724"]
["63-2405-2275",null,"31-0896-2024"]
["63-2408-2725",null,"31-0896-2025"]
["68-2011-1301",null,"31-0984-0523"]
[null,null,"31-1008-1420"]
[null,null,"31-1089-2424"]
[null,null,"31-1089-2425"]
[null,null,"31-1091-2023"]
[null,null,"31-1091-2024"]
[null,null,"31-1093-0479"]
[null,null,"31-1105-1923"]
[null,null,"31-1108-2323"]
[null,null,"31-1113-2223"]
[null,null,"31-1140-0522"]
[null,null,"31-1207-1880"]
[null,null,"31-1221-0924"]
[null,null,"31-1221-0925"]
[null,null,"31-1280-0825"]
[null,null,"31-1307-0787"]
[null,null,"31-1307-0788"]
[null,null,"31-1307-0789"]
[null,null,"31-1312-2187"]
[null,null,"31-1334-0726"]
[null,null,"31-1334-0727"]
[null,null,"31-1334-0728"]
[null,null,"31-1364-2023"]
[null,null,"31-1372-2224"]
[null,null,"31-1454-1923"]
[null,null,"31-1491-1825"]
[null,null,"31-1491-1827"]
[null,null,"31-1492-1825"]
[null,null,"31-1698-2324"]
[null,null,"31-1700-1126"]
[null,null,"31-1708-1092"]
[null,null,"31-1708-1093"]
[null,null,"31-1708-1094"]
[null,null,"31-1708-1095"]
[null,null,"31-1708-1096"]
[null,null,"33-3533-1250"]
[null,null,"33-3770-1250"]
[null,null,"33-3770-1251"]
[null,null,"33-3775-1651"]
[null,null,"33-3840-1250"]
[null,null,"33-3840-1251"]
[null,null,"33-3840-1252"]
[null,null,"33-3841-1250"]
[null,null,"33-3841-1251"]
[null,null,"34-0088-0104"]
[null,null,"34-0115-1101"]
[null,null,"34-0121-0600"]
[null,null,"34-0121-0601"]
[null,null,"34-0121-0602"]
[null,null,"34-0134-1000"]
[null,null,"34-0135-1000"]
[null,null,"34-0153-1896"]
[null,null,"34-0175-0600"]
[null,null,"34-0193-0266"]
[null,null,"34-0193-0267"]
[null,null,"34-0194-0065"]
[null,null,"34-0203-0601"]
[null,null,"34-0208-0762"]
[null,null,"34-0208-0763"]
[null,null,"34-0211-0987"]
[null,null,"34-0211-0988"]
[null,null,"34-0213-1062"]
[null,null,"34-0214-1000"]
[null,null,"34-0217-1310"]
[null,null,"34-0217-1311"]
[null,null,"34-0222-1691"]
[null,null,"34-0222-1692"]
[null,null,"34-0222-1707"]
[null,null,"34-0222-1708"]
[null,null,"34-0227-1000"]
[null,null,"34-0227-1001"]
[null,null,"34-0227-1002"]
[null,null,"34-0236-1299"]
[null,null,"34-0236-1300"]
[null,null,"34-0255-1897"]
[null,null,"34-0261-1996"]
[null,null,"34-0292-0071"]
[null,null,"34-0292-1100"]
[null,null,"34-0295-0519"]
[null,null,"34-0302-1897"]
[null,null,"34-0304-0731"]
[null,null,"34-0304-0732"]
[null,null,"34-0309-0947"]
[null,null,"34-0309-0962"]
[null,null,"34-0309-0963"]
[null,null,"34-0312-1087"]
[null,null,"34-0313-1087"]
[null,null,"34-0319-1234"]
[null,null,"34-0319-1235"]
[null,null,"34-0320-0102"]
[null,null,"34-0327-2274"]
[null,null,"34-0370-1100"]
[null,null,"34-0393-0399"]
[null,null,"34-0412-0101"]
[null,null,"34-0412-1302"]
[null,null,"34-0412-1303"]
[null,null,"34-0412-1304"]
[null,null,"34-0422-1897"]
[null,null,"34-0425-2097"]
[null,null,"34-0425-2163"]
[null,null,"34-0437-1995"]
[null,null,"34-0437-1996"]
[null,null,"34-0438-0302"]
[null,null,"34-0438-0303"]
[null,null,"34-0472-0399"]
[null,null,"34-0472-0400"]
[null,null,"34-0489-0282"]
[null,null,"34-0489-0283"]
[null,null,"34-0490-0390"]
[null,null,"34-0491-0111"]
[null,null,"34-0491-0112"]
[null,null,"34-0491-0113"]
[null,null,"34-0491-0114"]
[null,null,"34-0491-0998"]
[null,null,"34-0491-0999"]
[null,null,"34-0493-0545"]
[null,null,"34-0493-0546"]
[null,null,"34-0503-0905"]
[null,null,"34-0503-0906"]
[null,null,"34-0503-0907"]
[null,null,"34-0505-0992"]
[null,null,"34-0506-0993"]
[null,null,"34-0507-0399"]
[null,null,"34-0507-0400"]
[null,null,"34-0512-1297"]
[null,null,"34-0512-1298"]
[null,null,"34-0513-1398"]
[null,null,"34-0513-1399"]
[null,null,"34-0515-1496"]
[null,null,"34-0515-1497"]
[null,null,"34-0515-1498"]
[null,null,"34-0516-1561"]
[null,null,"34-0516-1562"]
[null,null,"34-0516-1563"]
[null,null,"34-0519-1776"]
[null,null,"34-0519-1777"]
[null,null,"34-0520-1294"]
[null,null,"34-0520-1295"]
[null,null,"34-0521-1912"]
[null,null,"34-0522-2027"]
[null,null,"34-0523-2053"]
[null,null,"34-0523-2082"]
[null,null,"34-0523-2114"]
[null,null,"34-0523-2115"]
[null,null,"34-0523-2116"]
[null,null,"34-0524-2171"]
[null,null,"34-0524-2172"]
[null,null,"34-0524-2224"]
[null,null,"34-0598-0099"]
[null,null,"34-0598-0100"]
[null,null,"34-0616-2191"]
[null,null,"34-0619-1825"]
[null,null,"34-0619-1826"]
[null,null,"34-0619-1864"]
[null,null,"34-0620-1864"]
[null,null,"34-0621-2042"]
[null,null,"34-0621-2043"]
[null,null,"34-0622-2098"]
[null,null,"34-0623-2191"]
[null,null,"34-0623-2210"]
[null,null,"34-0626-1695"]
[null,null,"34-0646-2190"]
[null,null,"34-0652-1694"]
[null,null,"34-0701-1494"]
[null,null,"34-0701-1495"]
[null,null,"34-0739-0399"]
[null,null,"34-0739-0400"]
[null,null,"34-0745-1819"]
[null,null,"34-0749-1802"]
[null,null,"34-0749-1817"]
[null,null,"34-0771-1593"]
[null,null,"34-0789-0367"]
[null,null,"34-0789-0368"]
[null,null,"34-0790-0457"]
[null,null,"34-0792-0609"]
[null,null,"34-0793-0657"]
[null,null,"34-0793-0658"]
[null,null,"34-0797-1000"]
[null,null,"34-0801-0997"]
[null,null,"34-0803-1161"]
[null,null,"34-0804-1161"]
[null,null,"34-0805-1204"]
[null,null,"34-0811-1641"]
[null,null,"34-0811-1642"]
[null,null,"34-0816-1929"]
[null,null,"34-0818-0599"]
[null,null,"34-0821-2277"]
[null,null,"34-0869-1692"]
[null,null,"34-0869-1693"]
[null,null,"34-0870-1692"]
[null,null,"34-0890-0459"]
[null,null,"34-0890-0460"]
[null,null,"34-0892-0593"]
[null,null,"34-0895-0888"]
[null,null,"34-0896-0889"]
[null,null,"34-0896-0936"]
[null,null,"34-0896-0937"]
[null,null,"34-0896-0938"]
[null,null,"34-0906-1364"]
[null,null,"34-0906-1365"]
[null,null,"34-0914-1901"]
[null,null,"34-0914-1902"]
[null,null,"34-0916-1994"]
[null,null,"34-0943-1988"]
[null,null,"34-0990-0410"]
[null,null,"34-0990-0411"]
[null,null,"34-0991-1313"]
[null,null,"34-0994-0847"]
[null,null,"34-0994-0848"]
[null,null,"34-0994-0849"]
[null,null,"34-0994-0884"]
[null,null,"34-0994-0885"]
[null,null,"34-0994-0886"]
[null,null,"34-0995-0960"]
[null,null,"34-0995-0961"]
[null,null,"34-0998-1095"]
[null,null,"34-0998-1097"]
[null,null,"34-1001-1248"]
[null,null,"34-1001-1249"]
[null,null,"34-1009-1566"]
[null,null,"34-1009-1567"]
[null,null,"34-1009-1568"]
[null,null,"34-1010-1668"]
[null,null,"34-1010-1669"]
[null,null,"34-1010-1670"]
[null,null,"34-1012-1808"]
[null,null,"34-1012-1809"]
[null,null,"34-1014-1944"]
[null,null,"34-1014-1945"]
[null,null,"34-1017-2084"]
[null,null,"34-1017-2085"]
[null,null,"34-1017-2086"]
[null,null,"34-1017-2196"]
[null,null,"34-1051-1689"]
[null,null,"34-1051-1690"]
[null,null,"34-1051-1691"]
[null,null,"34-1053-0399"]
[null,null,"34-1053-0400"]
[null,null,"34-1062-1489"]
[null,null,"34-1062-1490"]
[null,null,"34-1072-0898"]
[null,null,"34-1072-0899"]
[null,null,"34-1088-1988"]
[null,null,"34-1106-2087"]
[null,null,"34-1106-2088"]
[null,null,"34-1115-2020"]
[null,null,"34-1115-2059"]
[null,null,"34-1116-2059"]
[null,null,"34-1117-2232"]
[null,null,"34-1118-2256"]
[null,null,"34-1126-1489"]
[null,null,"34-1157-0003"]
[null,null,"34-1157-0004"]
[null,null,"34-1172-1291"]
[null,null,"34-1201-1269"]
[null,null,"34-1201-1270"]
[null,null,"34-1204-1423"]
[null,null,"34-1204-1458"]
[null,null,"34-1207-1677"]
[null,null,"34-1207-1713"]
[null,null,"34-1207-1714"]
[null,null,"34-1212-1927"]
[null,null,"34-1212-1928"]
[null,null,"34-1215-2106"]
[null,null,"34-1216-2187"]
[null,null,"34-1216-2188"]
[null,null,"34-1268-1686"]
[null,null,"34-1289-0554"]
[null,null,"34-1298-1063"]
[null,null,"34-1298-1064"]
[null,null,"34-1299-1422"]
[null,null,"34-1299-1423"]
[null,null,"34-1303-1695"]
[null,null,"34-1303-1696"]
[null,null,"34-1308-1955"]
[null,null,"34-1308-1956"]
[null,null,"34-1312-2222"]
[null,null,"34-1312-2223"]
[null,null,"34-1360-1987"]
[null,null,"34-1361-1987"]
[null,null,"34-1393-0101"]
[null,null,"34-1393-0102"]
[null,null,"34-1453-1685"]
[null,null,"34-1453-1686"]
[null,null,"34-1497-1473"]
[null,null,"34-1497-1474"]
[null,null,"34-1499-1501"]
[null,null,"34-1508-2024"]
[null,null,"34-1508-2025"]
[null,null,"34-1592-0861"]
[null,null,"34-1592-0862"]
[null,null,"34-1602-0476"]
[null,null,"34-1602-1698"]
[null,null,"34-1602-1699"]
[null,null,"34-1609-2021"]
[null,null,"34-1609-2022"]
[null,null,"34-1613-0506"]
[null,null,"34-1630-0891"]
[null,null,"34-1631-0891"]
[null,null,"34-1645-1684"]
[null,null,"34-1703-1933"]
[null,null,"34-1706-2075"]
[null,null,"34-1784-0888"]
[null,null,"34-1800-2083"]
[null,null,"34-1800-2084"]
[null,null,"34-1804-1973"]
[null,null,"34-1804-1974"]
[null,null,"34-1805-2085"]
[null,null,"34-1805-2086"]
[null,null,"34-1828-0191"]
[null,null,"34-1836-0291"]
[null,null,"34-1840-0092"]
[null,null,"34-1886-0020"]
[null,null,"34-1886-0021"]
[null,null,"34-1897-1775"]
[null,null,"34-1898-1512"]
[null,null,"34-1898-1834"]
[null,null,"34-1898-1835"]
[null,null,"34-1899-1512"]
[null,null,"34-1899-1677"]
[null,null,"34-1905-2144"]
[null,null,"34-1906-2210"]
[null,null,"34-1906-2211"]
[null,null,"34-1906-2212"]
[null,null,"34-1931-1487"]
[null,null,"34-1931-1488"]
[null,null,"34-2021-1488"]
[null,null,"34-2023-1485"]
[null,null,"34-2087-0562"]
[null,null,"34-2097-1536"]
[null,null,"34-2097-1537"]
[null,null,"34-2105-1977"]
[null,null,"34-2106-2153"]
[null,null,"34-2106-2266"]
[null,null,"34-2188-0575"]
[null,null,"34-2195-1686"]
[null,null,"34-2195-1687"]
[null,null,"34-2197-1969"]
[null,null,"34-2197-1970"]
[null,null,"34-2197-1971"]
[null,null,"34-2198-1686"]
[null,null,"34-2199-1686"]
[null,null,"34-2203-1987"]
[null,null,"34-2246-1585"]
[null,null,"34-2246-1586"]
[null,null,"34-2252-0000"]
[null,null,"34-2252-0001"]
[null,null,"34-2289-0904"]
[null,null,"34-2301-0090"]
[null,null,"34-2301-0091"]
[null,null,"34-2325-1888"]
[null,null,"34-2325-1889"]
[null,null,"34-2337-0189"]
[null,null,"34-2337-0190"]
[null,null,"34-2337-0191"]
[null,null,"34-2337-0289"]
[null,null,"34-2337-0290"]
[null,null,"34-2355-0088"]
[null,null,"34-2355-0089"]
[null,null,"34-2365-0489"]
[null,null,"34-2365-0490"]
[null,null,"34-2384-0038"]
[null,null,"34-2384-0039"]
[null,null,"34-2390-0371"]
[null,null,"34-2390-0372"]
[null,null,"34-2390-0409"]
[null,null,"34-2390-0410"]
[null,null,"34-2390-0505"]
[null,null,"34-2390-0506"]
[null,null,"34-2391-0599"]
[null,null,"34-2398-0589"]
[null,null,"34-2398-0590"]
[null,null,"34-2398-1864"]
[null,null,"34-2398-1865"]
[null,null,"34-2406-0489"]
[null,null,"34-2491-0288"]
[null,null,"34-2491-0589"]
[null,null,"34-2622-0588"]
[null,null,"34-2665-1586"]
[null,null,"34-2729-1187"]
[null,null,"34-2776-0887"]
[null,null,"34-2778-0163"]
[null,null,"34-2783-0330"]
[null,null,"34-2783-0385"]
[null,null,"34-2783-0399"]
[null,null,"34-2785-0280"]
[null,null,"34-2785-0485"]
[null,null,"34-2787-0850"]
[null,null,"34-2787-0973"]
[null,null,"34-2788-1028"]
[null,null,"34-2790-1145"]
[null,null,"34-2796-1643"]
[null,null,"34-2796-1644"]
[null,null,"34-2825-0788"]
[null,null,"34-2826-1187"]
[null,null,"34-2826-1188"]
[null,null,"34-2842-2189"]
[null,null,"34-2850-0887"]
[null,null,"34-2880-0887"]
[null,null,"34-2885-0725"]
[null,null,"34-2886-0749"]
[null,null,"34-2887-0883"]
[null,null,"34-2887-1287"]
[null,null,"34-2887-1287"]
[null,null,"34-2888-1004"]
[null,null,"34-2889-1108"]
[null,null,"34-2890-1176"]
[null,null,"34-2890-1177"]
[null,null,"34-2891-1213"]
[null,null,"34-2891-1214"]
[null,null,"34-2892-1287"]
[null,null,"34-2896-1586"]
[null,null,"34-2918-0187"]
[null,null,"34-2971-1687"]
[null,null,"34-2971-1688"]
[null,null,"34-2971-1689"]
[null,null,"34-2984-0531"]
[null,null,"34-2987-0875"]
[null,null,"34-2988-0992"]
[null,null,"34-2988-0993"]
[null,null,"34-2989-1096"]
[null,null,"34-2989-1148"]
[null,null,"34-2989-1149"]
[null,null,"34-2996-1530"]
[null,null,"34-2996-1531"]
[null,null,"34-2997-1591"]
[null,null,"34-2997-1592"]
[null,null,"34-2999-1712"]
[null,null,"34-2999-1713"]
[null,null,"34-2999-1714"]
[null,null,"34-3020-1886"]
[null,null,"34-3020-1986"]
[null,null,"34-3029-1687"]
[null,null,"34-3029-1688"]
[null,null,"34-3066-1186"]
[null,null,"34-3066-1187"]
[null,null,"34-3066-1286"]
[null,null,"34-3066-1287"]
[null,null,"34-3066-1288"]
[null,null,"34-3101-0487"]
[null,null,"34-3124-0886"]
[null,null,"34-3130-0286"]
[null,null,"34-3130-0287"]
[null,null,"34-3131-1087"]
[null,null,"34-3164-0286"]
[null,null,"34-3165-0286"]
[null,null,"34-3179-0233"]
[null,null,"34-3179-0234"]
[null,null,"34-3180-1686"]
[null,null,"34-3180-1687"]
[null,null,"34-3183-0563"]
[null,null,"34-3183-0564"]
[null,null,"34-3189-1020"]
[null,null,"34-3189-1021"]
[null,null,"34-3195-0185"]
[null,null,"34-3196-0185"]
[null,null,"34-3200-1645"]
[null,null,"34-3200-1646"]
[null,null,"34-3200-1677"]
[null,null,"34-3201-1677"]
[null,null,"34-3202-1836"]
[null,null,"34-3203-1899"]
[null,null,"34-3206-2140"]
[null,null,"34-3218-1886"]
[null,null,"34-3235-1087"]
[null,null,"34-3269-2085"]
[null,null,"34-3272-0586"]
[null,null,"34-3272-0587"]
[null,null,"34-3272-0588"]
[null,null,"34-3302-1969"]
[null,null,"34-3376-0066"]
[null,null,"34-3376-0067"]
[null,null,"34-3406-2214"]
[null,null,"34-3406-2251"]
[null,null,"34-3422-1284"]
[null,null,"34-3462-1284"]
[null,null,"34-3501-0785"]
[null,null,"34-3501-0786"]
[null,null,"34-3502-0586"]
[null,null,"34-3509-1285"]
[null,null,"34-3547-1984"]
[null,null,"34-3550-1684"]
[null,null,"34-3563-1285"]
[null,null,"34-3565-1884"]
[null,null,"34-3566-1884"]
[null,null,"34-3568-0386"]
[null,null,"34-3580-0436"]
[null,null,"34-3598-2184"]
[null,null,"35-1454-2222"]
[null,null,"35-1476-2118"]
[null,null,"35-1714-2118"]
[null,null,"35-1739-2118"]
[null,null,"35-1764-2117"]
[null,null,"35-1764-2118"]
[null,null,"35-1764-2119"]
[null,null,"36-0995-1262"]
[null,null,"36-0995-1271"]
[null,null,"36-0995-1272"]
[null,null,"36-2082-2061"]
[null,null,"36-2085-1726"]
[null,null,"36-2085-1737"]
[null,null,"36-2099-1308"]
[null,null,"36-2182-1314"]
[null,null,"36-2383-1869"]
[null,null,"36-2383-1870"]
[null,null,"37-0072-1013"]
[null,null,"37-0162-1014"]
[null,null,"37-0180-1014"]
[null,null,"37-0185-1107"]
[null,null,"37-0297-0955"]
[null,null,"37-0297-1077"]
[null,null,"37-0353-1015"]
[null,null,"37-0357-1015"]
[null,null,"37-0596-1213"]
[null,null,"37-0630-0377"]
[null,null,"37-0639-0313"]
[null,null,"37-0663-0708"]
[null,null,"37-0671-0703"]
[null,null,"37-0683-0654"]
[null,null,"37-0847-1682"]
[null,null,"37-0892-1583"]
[null,null,"37-0955-1107"]
[null,null,"37-0980-0349"]
[null,null,"37-0980-0421"]
[null,null,"37-1021-0404"]
[null,null,"37-1084-0886"]
[null,null,"37-1084-0925"]
[null,null,"37-1085-1005"]
[null,null,"37-1088-1553"]
[null,null,"37-1103-0704"]
[null,null,"37-1165-1003"]
[null,null,"37-1296-1303"]
[null,null,"37-1329-0399"]
[null,null,"37-1563-0068"]
[null,null,"37-1673-1455"]
[null,null,"37-1673-1581"]
[null,null,"37-1774-1298"]
[null,null,"37-1807-1297"]
[null,null,"37-1842-1297"]
[null,null,"37-1861-0757"]
[null,null,"37-1897-1196"]
[null,null,"37-1914-1798"]
[null,null,"37-1989-0695"]
[null,null,"37-2064-1343"]
[null,null,"37-2064-1435"]
[null,null,"37-2065-1513"]
[null,null,"37-2223-0794"]
[null,null,"37-2245-1194"]
[null,null,"37-2266-1628"]
[null,null,"37-2302-1696"]
[null,null,"37-2389-0993"]
[null,null,"37-2458-1064"]
[null,null,"37-2539-0992"]
[null,null,"37-2543-1192"]
[null,null,"37-2650-0343"]
[null,null,"37-2658-1154"]
[null,null,"37-2753-0572"]
[null,null,"37-2756-0965"]
[null,null,"37-2800-1089"]
[null,null,"38-0691-1396"]
[null,null,"38-0841-1800"]
[null,null,"38-2025-0726"]
[null,null,"38-2027-0726"]
[null,null,"38-2526-1300"]
[null,null,"38-2728-2101"]
[null,null,"38-2868-1679"]
[null,null,"38-2868-1680"]
[null,null,"38-2876-1801"]
[null,null,"38-2980-2001"]
[null,null,"38-2981-2562"]
[null,null,"38-3010-2601"]
[null,null,"38-3069-2854"]
[null,null,"38-3201-2985"]
[null,null,"38-3362-1424"]
[null,null,"38-3366-1388"]
[null,null,"38-3371-1740"]
[null,null,"39-0032-1115"]
[null,null,"39-0032-1116"]
[null,null,"39-0067-1015"]
[null,null,"39-0068-1015"]
[null,null,"39-0069-0616"]
[null,null,"39-0069-0617"]
[null,null,"39-0069-0618"]
[null,null,"39-0069-0619"]
[null,null,"39-0098-0394"]
[null,null,"39-0098-0395"]
[null,null,"39-0100-0815"]
[null,null,"39-0103-0516"]
[null,null,"39-0103-0517"]
[null,null,"39-0126-0216"]
[null,null,"39-0139-0115"]
[null,null,"39-0189-0516"]
[null,null,"39-0189-0517"]
[null,null,"39-0189-0518"]
[null,null,"39-0200-1327"]
[null,null,"39-0224-0516"]
[null,null,"39-0224-0517"]
[null,null,"39-0253-1314"]
[null,null,"39-0253-1315"]
[null,null,"39-0253-1316"]
[null,null,"39-0253-1317"]
[null,null,"39-0253-2412"]
[null,null,"39-0254-2412"]
[null,null,"39-0254-2413"]
[null,null,"39-0300-1288"]
[null,null,"39-0300-1290"]
[null,null,"39-0367-2013"]
[null,null,"39-0432-1614"]
[null,null,"39-0433-1614"]
[null,null,"39-0433-1615"]
[null,null,"39-0445-1514"]
[null,null,"39-0445-1515"]
[null,null,"39-0445-1516"]
[null,null,"39-0445-1517"]
[null,null,"39-0445-1518"]
[null,null,"39-0445-1519"]
[null,null,"39-0566-0515"]
[null,null,"39-0566-0516"]
[null,null,"39-0566-0517"]
[null,null,"39-0595-0128"]
[null,null,"39-0597-0428"]
[null,null,"39-0597-0429"]
[null,null,"39-0597-0599"]
[null,null,"39-0597-0600"]
[null,null,"39-0597-0601"]
[null,null,"39-0597-0602"]
[null,null,"39-0633-0715"]
[null,null,"39-0633-0716"]
[null,null,"39-0649-0114"]
[null,null,"39-0708-1314"]
[null,null,"39-0708-1315"]
[null,null,"39-0717-1315"]
[null,null,"39-0717-1316"]
[null,null,"39-0731-1515"]
[null,null,"39-0732-1515"]
[null,null,"39-0743-1315"]
[null,null,"39-0761-2016"]
[null,null,"39-0761-2017"]
[null,null,"39-0761-2018"]
[null,null,"39-0761-2019"]
[null,null,"39-0761-2020"]
[null,null,"39-0763-2216"]
[null,null,"39-0763-2217"]
[null,null,"39-0764-2216"]
[null,null,"39-0765-1616"]
[null,null,"39-0765-2216"]
[null,null,"39-0766-1616"]
[null,null,"39-0766-1617"]
[null,null,"39-0767-0214"]
[null,null,"39-0767-0215"]
[null,null,"39-0767-1616"]
[null,null,"39-0790-0463"]
[null,null,"39-0790-0464"]
[null,null,"39-0793-0660"]
[null,null,"39-0793-2116"]
[null,null,"39-0793-2117"]
[null,null,"39-0793-2118"]
[null,null,"39-0796-1169"]
[null,null,"39-0815-0214"]
[null,null,"39-0815-0215"]
[null,null,"39-0878-1014"]
[null,null,"39-0879-1114"]
[null,null,"39-0880-1014"]
[null,null,"39-0894-0990"]
[null,null,"39-0894-0991"]
[null,null,"39-0894-0992"]
[null,null,"39-0894-0993"]
[null,null,"39-0895-1217"]
[null,null,"39-0895-1218"]
[null,null,"39-0895-1219"]
[null,null,"39-0895-1779"]
[null,null,"39-0895-1780"]
[null,null,"39-0911-1114"]
[null,null,"39-0912-1114"]
[null,null,"39-0913-1114"]
[null,null,"39-0986-2314"]
[null,null,"39-0986-2315"]
[null,null,"39-1141-0114"]
[null,null,"39-1173-0264"]
[null,null,"39-1173-0265"]
[null,null,"39-1194-1943"]
[null,null,"39-1244-1614"]
[null,null,"39-1271-1714"]
[null,null,"39-1287-0294"]
[null,null,"39-1293-2027"]
[null,null,"39-1294-1739"]
[null,null,"39-1294-1915"]
[null,null,"39-1294-2028"]
[null,null,"39-1312-1814"]
[null,null,"39-1313-1814"]
[null,null,"39-1347-2013"]
[null,null,"39-1347-2014"]
[null,null,"39-1348-0615"]
[null,null,"39-1349-0615"]
[null,null,"39-1386-0268"]
[null,null,"39-1389-0678"]
[null,null,"39-1389-0679"]
[null,null,"39-1389-0680"]
[null,null,"39-1389-0773"]
[null,null,"39-1389-0774"]
[null,null,"39-1389-0775"]
[null,null,"39-1389-0776"]
[null,null,"39-1390-0842"]
[null,null,"39-1390-0843"]
[null,null,"39-1393-1954"]
[null,null,"39-1394-0713"]
[null,null,"39-1395-0713"]
[null,null,"39-1419-2313"]
[null,null,"39-1419-2314"]
[null,null,"39-1419-2315"]
[null,null,"39-1475-0113"]
[null,null,"39-1475-0114"]
[null,null,"39-1505-0003"]
[null,null,"39-1589-0978"]
[null,null,"39-1589-0979"]
[null,null,"39-1589-0980"]
[null,null,"39-1623-1064"]
[null,null,"39-1623-1065"]
[null,null,"39-1623-1066"]
[null,null,"39-1623-1067"]
[null,null,"39-1677-0615"]
[null,null,"39-1678-0615"]
[null,null,"39-1691-1165"]
[null,null,"39-1745-1014"]
[null,null,"39-1789-0997"]
[null,null,"39-1789-0998"]
[null,null,"39-1835-0615"]
[null,null,"39-1835-0616"]
[null,null,"39-1886-0477"]
[null,null,"39-1886-0478"]
[null,null,"39-1886-0769"]
[null,null,"39-1886-0770"]
[null,null,"39-1886-0771"]
[null,null,"39-1887-0614"]
[null,null,"39-1887-0615"]
[null,null,"39-1988-1218"]
[null,null,"39-1988-1219"]
[null,null,"39-1988-1311"]
[null,null,"39-1988-1509"]
[null,null,"39-1988-1510"]
[null,null,"39-1988-1511"]
[null,null,"39-2256-1116"]
[null,null,"39-2256-1117"]
[null,null,"39-2285-0005"]
[null,null,"39-2385-0238"]
[null,null,"39-2385-0239"]
[null,null,"39-2428-1015"]
[null,null,"39-2428-1016"]
[null,null,"39-2429-1015"]
[null,null,"39-2437-2114"]
[null,null,"39-2438-2114"]
[null,null,"39-2438-2115"]
[null,null,"39-2439-2114"]
[null,null,"39-2439-2115"]
[null,null,"39-2445-2014"]
[null,null,"39-2445-2015"]
[null,null,"39-2446-2014"]
[null,null,"39-2482-0667"]
[null,null,"39-2482-0668"]
[null,null,"39-2486-2113"]
[null,null,"39-2486-2114"]
[null,null,"39-2486-2119"]
[null,null,"39-2486-2120"]
[null,null,"39-2487-2217"]
[null,null,"39-2507-2313"]
[null,null,"39-2508-2313"]
[null,null,"39-2508-2314"]
[null,null,"39-2537-0313"]
[null,null,"39-2581-0724"]
[null,null,"39-2581-0725"]
[null,null,"39-2581-0726"]
[null,null,"39-2583-0879"]
[null,null,"39-2583-0880"]
[null,null,"39-2583-0910"]
[null,null,"39-2583-0911"]
[null,null,"39-2583-0912"]
[null,null,"39-2583-0913"]
[null,null,"39-2583-0914"]
[null,null,"39-2584-1674"]
[null,null,"39-2584-1714"]
[null,null,"39-2584-1715"]
[null,null,"39-2585-2066"]
[null,null,"39-2589-2387"]
[null,null,"39-2614-0213"]
[null,null,"39-2614-0214"]
[null,null,"39-2672-0213"]
[null,null,"39-2673-0213"]
[null,null,"39-2678-0210"]
[null,null,"39-2678-0211"]
[null,null,"39-2707-0213"]
[null,null,"39-2707-0214"]
[null,null,"39-2709-2109"]
[null,null,"39-2710-2109"]
[null,null,"39-2730-1512"]
[null,null,"39-2731-1512"]
[null,null,"39-2758-0114"]
[null,null,"39-2759-0113"]
[null,null,"39-2782-1273"]
[null,null,"39-2782-1274"]
[null,null,"39-2782-1275"]
[null,null,"39-2786-2197"]
[null,null,"39-2820-1610"]
[null,null,"39-2830-1220"]
[null,null,"39-2842-0811"]
[null,null,"39-2842-0812"]
[null,null,"39-2882-0941"]
[null,null,"39-2882-0942"]
[null,null,"39-2882-0984"]
[null,null,"39-2882-0985"]
[null,null,"39-2882-1709"]
[null,null,"39-2882-1710"]
[null,null,"39-2981-1195"]
[null,null,"39-2982-1900"]
[null,null,"39-2988-1906"]
[null,null,"39-2991-2008"]
[null,null,"39-3064-2308"]
[null,null,"39-3064-2309"]
[null,null,"39-3075-0053"]
[null,null,"39-3078-0443"]
[null,null,"39-3078-0444"]
[null,null,"39-3088-2390"]
[null,null,"39-3088-2391"]
[null,null,"39-3098-0008"]
[null,null,"39-3098-0009"]
[null,null,"39-3124-0959"]
[null,null,"39-3179-0510"]
[null,null,"39-3182-1273"]
[null,null,"39-3182-1274"]
[null,null,"39-3182-1276"]
[null,null,"39-3182-1277"]
[null,null,"39-3183-1348"]
[null,null,"39-3183-1349"]
[null,null,"39-3200-0808"]
[null,null,"39-3201-0808"]
[null,null,"39-3202-0808"]
[null,null,"39-3234-0909"]
[null,null,"39-3234-0910"]
[null,null,"39-3272-0310"]
[null,null,"39-3276-0306"]
[null,null,"39-3276-0307"]
[null,null,"39-3278-0464"]
[null,null,"39-3278-0467"]
[null,null,"39-3278-0738"]
[null,null,"39-3282-1232"]
[null,null,"39-3282-1340"]
[null,null,"39-3282-1341"]
[null,null,"39-3287-1209"]
[null,null,"39-3287-2084"]
[null,null,"39-3322-2110"]
[null,null,"39-3388-2240"]
[null,null,"39-3455-0609"]
[null,null,"39-3455-0610"]
[null,null,"39-3467-0809"]
[null,null,"39-3468-0809"]
[null,null,"39-3468-0810"]
[null,null,"39-3477-0571"]
[null,null,"39-3477-0572"]
[null,null,"39-3477-0573"]
[null,null,"39-3477-0825"]
[null,null,"39-3477-0833"]
[null,null,"39-3477-0834"]
[null,null,"39-3477-0835"]
[null,null,"39-3485-0451"]
[null,null,"39-3486-0450"]
[null,null,"39-3486-0451"]
[null,null,"39-3558-0609"]
[null,null,"39-3566-0309"]
[null,null,"39-3566-0310"]
[null,null,"39-3566-0311"]
[null,null,"39-3566-0312"]
[null,null,"39-3577-1009"]
[null,null,"39-3578-1009"]
[null,null,"40-0026-0798"]
[null,null,"40-0040-1341"]
[null,null,"40-0100-0748"]
[null,null,"40-0154-0699"]
[null,null,"40-0200-0695"]
[null,null,"40-0201-0807"]
[null,null,"40-0201-0999"]
[null,null,"40-0204-1219"]
[null,null,"40-0215-0005"]
[null,null,"40-0216-0004"]
[null,null,"40-0246-1200"]
[null,null,"40-0246-1201"]
[null,null,"40-0305-2297"]
[null,null,"40-0306-1744"]
[null,null,"40-0313-1100"]
[null,null,"40-0318-0097"]
[null,null,"40-0318-0098"]
[null,null,"40-0319-2302"]
[null,null,"40-0396-1100"]
[null,null,"40-0423-2402"]
[null,null,"40-0453-0096"]
[null,null,"40-0453-0097"]
[null,null,"40-0496-0142"]
[null,null,"40-0496-0143"]
[null,null,"40-0501-0853"]
[null,null,"40-0504-1899"]
[null,null,"40-0505-1685"]
[null,null,"40-0505-1761"]
[null,null,"40-0505-2106"]
[null,null,"40-0505-2155"]
[null,null,"40-0505-2171"]
[null,null,"40-0545-2302"]
[null,null,"40-0578-1903"]
[null,null,"40-0612-2002"]
[null,null,"40-0616-1200"]
[null,null,"40-0699-1305"]
[null,null,"40-0702-1966"]
[null,null,"40-0703-1301"]
[null,null,"40-0729-0098"]
[null,null,"40-0759-1000"]
[null,null,"40-0781-1301"]
[null,null,"40-0782-1301"]
[null,null,"40-0793-1652"]
[null,null,"40-0794-1652"]
[null,null,"40-0797-1023"]
[null,null,"40-0799-1319"]
[null,null,"40-0802-2043"]
[null,null,"40-0848-1302"]
[null,null,"40-0913-1703"]
[null,null,"40-0913-1704"]
[null,null,"40-0921-1502"]
[null,null,"40-0931-1552"]
[null,null,"40-0944-1202"]
[null,null,"40-0971-0200"]
[null,null,"40-0995-0440"]
[null,null,"40-1011-0200"]
[null,null,"40-1012-0200"]
[null,null,"40-1012-1553"]
[null,null,"40-1012-1554"]
[null,null,"40-1033-0401"]
[null,null,"40-1094-0235"]
[null,null,"40-1094-0289"]
[null,null,"40-1095-0733"]
[null,null,"40-1095-0734"]
[null,null,"40-1098-1371"]
[null,null,"40-1102-2175"]
[null,null,"40-1133-2204"]
[null,null,"40-1133-2205"]
[null,null,"40-1162-0803"]
[null,null,"40-1207-0502"]
[null,null,"40-1243-1102"]
[null,null,"40-1294-0689"]
[null,null,"40-1296-1571"]
[null,null,"40-1296-1628"]
[null,null,"40-1340-0601"]
[null,null,"40-1365-0601"]
[null,null,"40-1383-1704"]
[null,null,"40-1392-0535"]
[null,null,"40-1393-0633"]
[null,null,"40-1398-1721"]
[null,null,"40-1399-1967"]
[null,null,"40-1401-2160"]
[null,null,"40-1401-2161"]
[null,null,"40-1488-1703"]
[null,null,"40-1556-1201"]
[null,null,"40-1595-1200"]
[null,null,"40-1595-1445"]
[null,null,"40-1598-1709"]
[null,null,"40-1598-1710"]
[null,null,"40-1598-1711"]
[null,null,"40-1598-1736"]
[null,null,"40-1599-1924"]
[null,null,"40-1599-1925"]
[null,null,"40-1636-1903"]
[null,null,"40-1636-1904"]
[null,null,"40-1639-1903"]
[null,null,"40-1639-1904"]
[null,null,"40-1694-1150"]
[null,null,"40-1694-1151"]
[null,null,"40-1694-2003"]
[null,null,"40-1694-2004"]
[null,null,"40-1695-2004"]
[null,null,"40-1700-2286"]
[null,null,"40-1760-0601"]
[null,null,"40-1764-1903"]
[null,null,"40-1765-1903"]
[null,null,"40-1769-0702"]
[null,null,"40-1868-1604"]
[null,null,"40-1873-0400"]
[null,null,"40-1888-0448"]
[null,null,"40-1888-0473"]
[null,null,"40-1921-0216"]
[null,null,"40-1934-2003"]
[null,null,"40-1989-0575"]
[null,null,"40-1996-0219"]
[null,null,"40-2109-0499"]
[null,null,"40-2168-1215"]
[null,null,"40-2188-0168"]
[null,null,"40-2206-0498"]
[null,null,"40-2230-0598"]
[null,null,"40-2237-2302"]
[null,null,"40-2297-1964"]
[null,null,"40-2297-1965"]
[null,null,"40-2311-0399"]
[null,null,"40-2311-0400"]
[null,null,"40-2321-0398"]
[null,null,"40-2321-0399"]
[null,null,"40-2322-0398"]
[null,null,"40-2383-0032"]
[null,null,"40-2384-0032"]
[null,null,"40-2390-0769"]
[null,null,"40-2394-1401"]
[null,null,"41-1701-0403"]
[null,null,"41-1701-0404"]
[null,null,"41-1708-0417"]
[null,null,"41-1708-0418"]
[null,null,"42-0002-1375"]
[null,null,"42-0003-1776"]
[null,null,"42-0064-0873"]
[null,null,"42-0088-2779"]
[null,null,"42-0094-0010"]
[null,null,"42-0094-0366"]
[null,null,"42-0095-0414"]
[null,null,"42-0095-0415"]
[null,null,"42-0095-0416"]
[null,null,"42-0095-0417"]
[null,null,"42-0096-2679"]
[null,null,"42-0098-1576"]
[null,null,"42-0102-2679"]
[null,null,"42-0102-2690"]
[null,null,"42-0102-2801"]
[null,null,"42-0105-0002"]
[null,null,"42-0139-0773"]
[null,null,"42-0151-0873"]
[null,null,"42-0181-0572"]
[null,null,"42-0197-2177"]
[null,null,"42-0199-0171"]
[null,null,"42-0217-1074"]
[null,null,"42-0229-0472"]
[null,null,"42-0230-0472"]
[null,null,"42-0246-2478"]
[null,null,"42-0261-2178"]
[null,null,"42-0278-0874"]
[null,null,"42-0290-2479"]
[null,null,"42-0295-0686"]
[null,null,"42-0296-1046"]
[null,null,"42-0296-1219"]
[null,null,"42-0296-1425"]
[null,null,"42-0296-1678"]
[null,null,"42-0297-1074"]
[null,null,"42-0300-2214"]
[null,null,"42-0301-2379"]
[null,null,"42-0353-0573"]
[null,null,"42-0395-0621"]
[null,null,"42-0395-1442"]
[null,null,"42-0396-1015"]
[null,null,"42-0396-1021"]
[null,null,"42-0396-1031"]
[null,null,"42-0396-1044"]
[null,null,"42-0396-1074"]
[null,null,"42-0396-1090"]
[null,null,"42-0396-1441"]
[null,null,"42-0401-2314"]
[null,null,"42-0401-2437"]
[null,null,"42-0401-2537"]
[null,null,"42-0402-2621"]
[null,null,"42-0431-0674"]
[null,null,"42-0433-1475"]
[null,null,"42-0439-0573"]
[null,null,"42-0443-1576"]
[null,null,"42-0444-0673"]
[null,null,"42-0457-2378"]
[null,null,"42-0458-1275"]
[null,null,"42-0481-0172"]
[null,null,"42-0484-1576"]
[null,null,"42-0498-0674"]
[null,null,"42-0514-1576"]
[null,null,"42-0539-0573"]
[null,null,"42-0555-1476"]
[null,null,"42-0557-2178"]
[null,null,"42-0580-2378"]
[null,null,"42-0581-2378"]
[null,null,"42-0594-0415"]
[null,null,"42-0595-0862"]
[null,null,"42-0595-0874"]
[null,null,"42-0595-0875"]
[null,null,"42-0596-1447"]
[null,null,"42-0596-1734"]
[null,null,"42-0599-2056"]
[null,null,"42-0601-2263"]
[null,null,"42-0601-2443"]
[null,null,"42-0601-2589"]
[null,null,"42-0601-2684"]
[null,null,"42-0601-2701"]
[null,null,"42-0602-2783"]
[null,null,"42-0626-0875"]
[null,null,"42-0674-0876"]
[null,null,"42-0676-0374"]
[null,null,"42-0680-0976"]
[null,null,"42-0690-0460"]
[null,null,"42-0693-0894"]
[null,null,"42-0693-0895"]
[null,null,"42-0695-1763"]
[null,null,"42-0697-0876"]
[null,null,"42-0697-0877"]
[null,null,"42-0697-2193"]
[null,null,"42-0697-2194"]
[null,null,"42-0698-2217"]
[null,null,"42-0699-2504"]
[null,null,"42-0699-2566"]
[null,null,"42-0699-2621"]
[null,null,"42-0699-2761"]
[null,null,"42-0699-2762"]
[null,null,"42-0700-2479"]
[null,null,"42-0700-2795"]
[null,null,"42-0742-0976"]
[null,null,"42-0745-2078"]
[null,null,"42-0746-2479"]
[null,null,"42-0752-2679"]
[null,null,"42-0756-0976"]
[null,null,"42-0758-1275"]
[null,null,"42-0760-0976"]
[null,null,"42-0807-2178"]
[null,null,"42-0808-2078"]
[null,null,"42-0813-0375"]
[null,null,"42-0847-1577"]
[null,null,"42-0851-0876"]
[null,null,"42-0864-1577"]
[null,null,"42-0868-2178"]
[null,null,"42-0891-0448"]
[null,null,"42-0891-2179"]
[null,null,"42-0892-0706"]
[null,null,"42-0894-1559"]
[null,null,"42-0895-1752"]
[null,null,"42-0896-2055"]
[null,null,"42-0897-2129"]
[null,null,"42-0897-2192"]
[null,null,"42-0899-2379"]
[null,null,"42-0899-2539"]
[null,null,"42-0899-2835"]
[null,null,"42-0909-2078"]
[null,null,"42-0940-1878"]
[null,null,"42-0947-2379"]
[null,null,"42-0949-1577"]
[null,null,"42-0955-1778"]
[null,null,"42-0960-2179"]
[null,null,"42-0977-2378"]
[null,null,"42-0996-2479"]
[null,null,"42-1016-2779"]
[null,null,"42-1017-0876"]
[null,null,"42-1019-1577"]
[null,null,"42-1057-2078"]
[null,null,"42-1058-2479"]
[null,null,"42-1059-2078"]
[null,null,"42-1060-2078"]
[null,null,"42-1071-2078"]
[null,null,"42-1071-2079"]
[null,null,"42-1074-2378"]
[null,null,"42-1092-0943"]
[null,null,"42-1096-2067"]
[null,null,"42-1098-2415"]
[null,null,"42-1098-2416"]
[null,null,"42-1098-2556"]
[null,null,"42-1099-2178"]
[null,null,"42-1099-2557"]
[null,null,"42-1102-1077"]
[null,null,"42-1153-0977"]
[null,null,"42-1164-1577"]
[null,null,"42-1188-2178"]
[null,null,"42-1189-0271"]
[null,null,"42-1190-0332"]
[null,null,"42-1192-1017"]
[null,null,"42-1196-2479"]
[null,null,"42-1251-1478"]
[null,null,"42-1252-1278"]
[null,null,"42-1265-1478"]
[null,null,"42-1277-1578"]
[null,null,"42-1285-0257"]
[null,null,"42-1285-0258"]
[null,null,"42-1285-0259"]
[null,null,"42-1286-0374"]
[null,null,"42-1288-0709"]
[null,null,"42-1288-1039"]
[null,null,"42-1288-1053"]
[null,null,"42-1288-1054"]
[null,null,"42-1288-2679"]
[null,null,"42-1290-1360"]
[null,null,"42-1293-2104"]
[null,null,"42-1296-2509"]
[null,null,"42-1297-2616"]
[null,null,"42-1297-2617"]
[null,null,"42-1297-2679"]
[null,null,"42-1297-2738"]
[null,null,"42-1298-2759"]
[null,null,"42-1315-2478"]
[null,null,"42-1317-0977"]
[null,null,"42-1326-0677"]
[null,null,"42-1329-2679"]
[null,null,"42-1329-2779"]
[null,null,"42-1339-1879"]
[null,null,"42-1359-1077"]
[null,null,"42-1363-2479"]
[null,null,"42-1390-1508"]
[null,null,"42-1390-1509"]
[null,null,"42-1391-1629"]
[null,null,"42-1391-1637"]
[null,null,"42-1391-1693"]
[null,null,"42-1391-1738"]
[null,null,"42-1392-2090"]
[null,null,"42-1393-2214"]
[null,null,"42-1395-2552"]
[null,null,"42-1396-2552"]
[null,null,"42-1396-2624"]
[null,null,"42-1396-2679"]
[null,null,"42-1397-2804"]
[null,null,"42-1398-2829"]
[null,null,"42-1413-2479"]
[null,null,"42-1415-0577"]
[null,null,"42-1416-0577"]
[null,null,"42-1434-0176"]
[null,null,"42-1434-0177"]
[null,null,"42-1434-2479"]
[null,null,"42-1446-1879"]
[null,null,"42-1451-0176"]
[null,null,"42-1452-2779"]
[null,null,"42-1457-0577"]
[null,null,"42-1457-1077"]
[null,null,"42-1459-0977"]
[null,null,"42-1465-1879"]
[null,null,"42-1475-2478"]
[null,null,"42-1481-1178"]
[null,null,"42-1481-2679"]
[null,null,"42-1485-0367"]
[null,null,"42-1486-0519"]
[null,null,"42-1497-2080"]
[null,null,"42-1498-1178"]
[null,null,"42-1510-1279"]
[null,null,"42-1552-0878"]
[null,null,"42-1559-1478"]
[null,null,"42-1559-1479"]
[null,null,"42-1562-2479"]
[null,null,"42-1581-1478"]
[null,null,"42-1582-1479"]
[null,null,"42-1582-1880"]
[null,null,"42-1587-0803"]
[null,null,"42-1588-0903"]
[null,null,"42-1588-0914"]
[null,null,"42-1589-1417"]
[null,null,"42-1591-1862"]
[null,null,"42-1591-1871"]
[null,null,"42-1591-1984"]
[null,null,"42-1592-2026"]
[null,null,"42-1592-2055"]
[null,null,"42-1592-2146"]
[null,null,"42-1593-2339"]
[null,null,"42-1594-2506"]
[null,null,"42-1595-2578"]
[null,null,"42-1596-2773"]
[null,null,"42-1597-2850"]
[null,null,"42-1600-1579"]
[null,null,"42-1602-2779"]
[null,null,"42-1606-2479"]
[null,null,"42-1614-0878"]
[null,null,"42-1616-2779"]
[null,null,"42-1639-1520"]
[null,null,"42-1660-2679"]
[null,null,"42-1671-0978"]
[null,null,"42-1671-0979"]
[null,null,"42-1686-0525"]
[null,null,"42-1692-2030"]
[null,null,"42-1692-2082"]
[null,null,"42-1692-2083"]
[null,null,"42-1692-2230"]
[null,null,"42-1693-2260"]
[null,null,"42-1694-2351"]
[null,null,"42-1695-2481"]
[null,null,"42-1695-2534"]
[null,null,"42-1701-2679"]
[null,null,"42-1703-2080"]
[null,null,"42-1709-2080"]
[null,null,"42-1724-2080"]
[null,null,"42-1744-2480"]
[null,null,"42-1744-2481"]
[null,null,"42-1751-0678"]
[null,null,"42-1776-1279"]
[null,null,"42-1779-0586"]
[null,null,"42-1779-0678"]
[null,null,"42-1786-0613"]
[null,null,"42-1786-0831"]
[null,null,"42-1787-0678"]
[null,null,"42-1787-1039"]
[null,null,"42-1787-1040"]
[null,null,"42-1787-1087"]
[null,null,"42-1795-2678"]
[null,null,"42-1795-2719"]
[null,null,"42-1796-2765"]
[null,null,"42-1796-2789"]
[null,null,"42-1796-2813"]
[null,null,"42-1797-2858"]
[null,null,"42-1811-2780"]
[null,null,"42-1820-2679"]
[null,null,"42-1828-2080"]
[null,null,"42-1843-2480"]
[null,null,"42-1849-2076"]
[null,null,"42-1852-2679"]
[null,null,"42-1872-2479"]
[null,null,"42-1876-2379"]
[null,null,"42-1877-0978"]
[null,null,"42-1881-2080"]
[null,null,"42-1882-2780"]
[null,null,"42-1892-2262"]
[null,null,"42-1893-2362"]
[null,null,"42-1893-2398"]
[null,null,"42-1894-2452"]
[null,null,"42-1895-2660"]
[null,null,"42-1896-2688"]
[null,null,"42-1896-2689"]
[null,null,"42-1896-2690"]
[null,null,"42-1903-2679"]
[null,null,"42-1903-2680"]
[null,null,"42-1907-2380"]
[null,null,"42-1915-2680"]
[null,null,"42-1924-0878"]
[null,null,"42-1925-2079"]
[null,null,"42-1926-2079"]
[null,null,"42-1927-2279"]
[null,null,"42-1939-2780"]
[null,null,"42-1948-1079"]
[null,null,"42-1948-1080"]
[null,null,"42-1978-2679"]
[null,null,"42-1985-0798"]
[null,null,"42-1986-0866"]
[null,null,"42-1997-2079"]
[null,null,"42-2001-2179"]
[null,null,"42-2007-2079"]
[null,null,"42-2047-2680"]
[null,null,"42-2060-2680"]
[null,null,"42-2070-2279"]
[null,null,"42-2074-2179"]
[null,null,"42-2090-2028"]
[null,null,"42-2090-2030"]
[null,null,"42-2090-2037"]
[null,null,"42-2090-2179"]
[null,null,"42-2094-2740"]
[null,null,"42-2095-2751"]
[null,null,"42-2095-2787"]
[null,null,"42-2095-2841"]
[null,null,"42-2104-2780"]
[null,null,"42-2121-2279"]
[null,null,"42-2138-2179"]
[null,null,"42-2156-2780"]
[null,null,"42-2156-2781"]
[null,null,"42-2158-2179"]
[null,null,"42-2250-2041"]
[null,null,"42-2252-2050"]
[null,null,"43-3495-2506"]
[null,null,"43-4162-3992"]
[null,null,"43-4162-3993"]
[null,null,"43-4195-3957"]
[null,null,"43-4407-4660"]
[null,null,"43-4407-4661"]
[null,null,"43-4519-4553"]
[null,null,"43-4754-4960"]
[null,null,"43-4755-4960"]
[null,null,"43-4820-4822"]
[null,null,"43-4820-4823"]
[null,null,"43-5013-4564"]
[null,null,"43-5178-2542"]
[null,null,"44-0051-0713"]
[null,null,"44-0052-0713"]
[null,null,"44-0085-0109"]
[null,null,"44-0107-0001"]
[null,null,"44-0120-0410"]
[null,null,"44-0148-0510"]
[null,null,"44-0157-0712"]
[null,null,"44-0158-0712"]
[null,null,"44-0197-0130"]
[null,null,"44-0197-0428"]
[null,null,"44-0197-0429"]
[null,null,"44-0198-0075"]
[null,null,"44-0198-0554"]
[null,null,"44-0198-0637"]
[null,null,"44-0198-0638"]
[null,null,"44-0199-0606"]
[null,null,"44-0199-0755"]
[null,null,"44-0209-1722"]
[null,null,"44-0209-1723"]
[null,null,"44-0254-0509"]
[null,null,"44-0277-0408"]
[null,null,"44-0278-0408"]
[null,null,"44-0281-1914"]
[null,null,"44-0282-0106"]
[null,null,"44-0282-1914"]
[null,null,"44-0283-0106"]
[null,null,"44-0297-0100"]
[null,null,"44-0297-0406"]
[null,null,"44-0297-0407"]
[null,null,"44-0297-0492"]
[null,null,"44-0297-0590"]
[null,null,"44-0299-0910"]
[null,null,"44-0308-1694"]
[null,null,"44-0308-1695"]
[null,null,"44-0308-1696"]
[null,null,"44-0350-2013"]
[null,null,"44-0358-2313"]
[null,null,"44-0398-0577"]
[null,null,"44-0426-1913"]
[null,null,"44-0444-1813"]
[null,null,"44-0445-1813"]
[null,null,"44-0507-2129"]
[null,null,"44-0508-2380"]
[null,null,"44-0608-2140"]
[null,null,"44-0608-2141"]
[null,null,"44-0766-0209"]
[null,null,"44-0899-0542"]
[null,null,"44-0940-0003"]
[null,null,"44-0941-0003"]
[null,null,"44-0942-0003"]
[null,null,"44-0999-0750"]
[null,null,"44-1000-0873"]
[null,null,"44-1000-0874"]
[null,null,"44-1103-1508"]
[null,null,"44-1145-1412"]
[null,null,"44-1146-1213"]
[null,null,"44-1149-0312"]
[null,null,"44-1150-0312"]
[null,null,"44-1164-0003"]
[null,null,"44-1197-0376"]
[null,null,"44-1198-0076"]
[null,null,"44-1198-0077"]
[null,null,"44-1202-1131"]
[null,null,"44-1209-2115"]
[null,null,"44-1308-2127"]
[null,null,"44-1308-2128"]
[null,null,"44-1308-2139"]
[null,null,"44-1310-0311"]
[null,null,"44-1312-0311"]
[null,null,"44-1317-1113"]
[null,null,"44-1317-1114"]
[null,null,"44-1324-1014"]
[null,null,"44-1345-1813"]
[null,null,"44-1384-2313"]
[null,null,"44-1385-2313"]
[null,null,"44-1385-2314"]
[null,null,"44-1393-0311"]
[null,null,"44-1395-0498"]
[null,null,"44-1406-0311"]
[null,null,"44-1407-2252"]
[null,null,"44-1408-1417"]
[null,null,"44-1408-1418"]
[null,null,"44-1409-1606"]
[null,null,"44-1409-1804"]
[null,null,"44-1409-1949"]
[null,null,"44-1409-1950"]
[null,null,"44-1409-1951"]
[null,null,"44-1409-2026"]
[null,null,"44-1409-2027"]
[null,null,"44-1476-0513"]
[null,null,"44-1477-0513"]
[null,null,"44-1478-0513"]
[null,null,"44-1500-2012"]
[null,null,"44-1507-2313"]
[null,null,"44-1507-2327"]
[null,null,"44-1507-2328"]
[null,null,"44-1507-2342"]
[null,null,"44-1507-2343"]
[null,null,"44-1508-2145"]
[null,null,"44-1509-1745"]
[null,null,"44-1509-1746"]
[null,null,"44-1509-2003"]
[null,null,"44-1509-2004"]
[null,null,"44-1570-2313"]
[null,null,"44-1570-2314"]
[null,null,"44-1607-2304"]
[null,null,"44-1613-0005"]
[null,null,"44-1615-0813"]
[null,null,"44-1656-0513"]
[null,null,"44-1657-0513"]
[null,null,"44-1696-0714"]
[null,null,"44-1696-0717"]
[null,null,"44-1758-0512"]
[null,null,"44-1793-1613"]
[null,null,"44-1802-1197"]
[null,null,"44-1808-0912"]
[null,null,"44-1808-1572"]
[null,null,"44-1808-1684"]
[null,null,"44-1820-1212"]
[null,null,"44-1827-1112"]
[null,null,"44-1879-0713"]
[null,null,"44-1879-0813"]
[null,null,"44-1879-0814"]
[null,null,"44-1879-0815"]
[null,null,"44-1879-0816"]
[null,null,"44-1890-1813"]
[null,null,"44-1895-0228"]
[null,null,"44-1895-0229"]
[null,null,"44-1898-0757"]
[null,null,"44-1898-2313"]
[null,null,"44-1900-1145"]
[null,null,"44-1900-1146"]
[null,null,"44-1903-1378"]
[null,null,"44-1903-1928"]
[null,null,"44-1904-1612"]
[null,null,"44-1904-1613"]
[null,null,"44-1904-1619"]
[null,null,"44-1904-1620"]
[null,null,"44-1904-1910"]
[null,null,"44-1904-2358"]
[null,null,"44-1908-1818"]
[null,null,"44-1926-0006"]
[null,null,"44-1926-0007"]
[null,null,"44-1960-1112"]
[null,null,"44-1961-1112"]
[null,null,"44-1981-0215"]
[null,null,"44-1993-1813"]
[null,null,"44-1996-1813"]
[null,null,"44-1996-1814"]
[null,null,"44-1996-1815"]
[null,null,"44-1999-1096"]
[null,null,"44-2003-2306"]
[null,null,"44-2026-1112"]
[null,null,"44-2057-0614"]
[null,null,"44-2080-0499"]
[null,null,"44-2124-1092"]
[null,null,"44-2125-1106"]
[null,null,"44-2128-2213"]
[null,null,"44-2138-2213"]
[null,null,"44-2139-2313"]
[null,null,"44-2144-0262"]
[null,null,"44-2184-2212"]
[null,null,"44-2195-0442"]
[null,null,"44-2195-0545"]
[null,null,"44-2196-0489"]
[null,null,"44-2200-1172"]
[null,null,"44-2200-1191"]
[null,null,"44-2202-2200"]
[null,null,"44-2202-2221"]
[null,null,"44-2203-2360"]
[null,null,"44-2215-1663"]
[null,null,"44-2219-0812"]
[null,null,"44-2226-0613"]
[null,null,"44-2230-1111"]
[null,null,"44-2249-1424"]
[null,null,"44-2249-1437"]
[null,null,"44-2249-1438"]
[null,null,"44-2250-1486"]
[null,null,"44-2257-0111"]
[null,null,"44-2296-1211"]
[null,null,"44-2299-1302"]
[null,null,"44-2347-0109"]
[null,null,"44-2354-2313"]
[null,null,"44-2397-2013"]
[null,null,"44-2402-2033"]
[null,null,"45-3586-0935"]
[null,null,"45-3899-0582"]
[null,null,"45-3899-0583"]
[null,null,"45-3900-0583"]
[null,null,"45-3935-0506"]
[null,null,"45-3993-0506"]
[null,null,"45-3993-0507"]
[null,null,"45-3993-0508"]
[null,null,"45-4115-0306"]
[null,null,"45-4117-0306"]
[null,null,"45-4118-0306"]
[null,null,"45-4222-0106"]
[null,null,"45-4260-0107"]
[null,null,"45-4279-0379"]
[null,null,"45-4279-0380"]
[null,null,"45-4279-0382"]
[null,null,"45-4279-0383"]
[null,null,"45-4376-0107"]
[null,null,"45-4377-0210"]
[null,null,"45-4377-0211"]
[null,null,"45-4378-0267"]
[null,null,"45-4379-0398"]
[null,null,"45-4379-0399"]
[null,null,"45-4380-0434"]
[null,null,"45-4476-0107"]
[null,null,"45-4528-0409"]
[null,null,"45-4544-0409"]
[null,null,"45-4557-0410"]
[null,null,"45-4761-0314"]
[null,null,"46-0402-1147"]
[null,null,"46-0503-0460"]
[null,null,"46-0552-0198"]
[null,null,"46-0593-2104"]
[null,null,"46-0600-2121"]
[null,null,"46-0665-0900"]
[null,null,"46-0696-2204"]
[null,null,"46-0703-2104"]
[null,null,"46-0998-2288"]
[null,null,"46-0998-2316"]
[null,null,"46-0998-2330"]
[null,null,"46-0998-2350"]
[null,null,"46-1000-2052"]
[null,null,"46-1018-2005"]
[null,null,"46-1107-2105"]
[null,null,"46-1121-2105"]
[null,null,"46-1199-2341"]
[null,null,"46-1249-1804"]
[null,null,"46-1253-1604"]
[null,null,"46-1271-1805"]
[null,null,"46-1272-1604"]
[null,null,"46-1299-1345"]
[null,null,"46-1300-1744"]
[null,null,"46-1300-2003"]
[null,null,"46-1348-0201"]
[null,null,"46-1375-0201"]
[null,null,"46-1381-0302"]
[null,null,"46-1397-1920"]
[null,null,"46-1397-2049"]
[null,null,"46-1397-2050"]
[null,null,"46-1397-2051"]
[null,null,"46-1400-1628"]
[null,null,"46-1404-0131"]
[null,null,"46-1474-0903"]
[null,null,"46-1500-2171"]
[null,null,"46-1500-2172"]
[null,null,"46-1542-1305"]
[null,null,"46-1600-1180"]
[null,null,"46-1601-0824"]
[null,null,"46-1601-0917"]
[null,null,"46-1601-1060"]
[null,null,"46-1601-1286"]
[null,null,"46-1628-0304"]
[null,null,"46-1673-0304"]
[null,null,"46-1682-1206"]
[null,null,"46-1754-0906"]
[null,null,"46-1754-0907"]
[null,null,"46-1756-0906"]
[null,null,"46-1801-0530"]
[null,null,"46-1801-0610"]
[null,null,"46-1829-0756"]
[null,null,"46-1901-0241"]
[null,null,"46-1983-1107"]
[null,null,"46-1995-2134"]
[null,null,"46-2001-0332"]
[null,null,"46-2027-0741"]
[null,null,"46-2118-0205"]
[null,null,"46-2126-0205"]
[null,null,"46-2201-0590"]
[null,null,"46-2201-0663"]
[null,null,"46-2202-0788"]
[null,null,"46-2596-2408"]
[null,null,"46-2705-0057"]
[null,null,"46-2706-1202"]
[null,null,"46-2730-1248"]
[null,null,"46-2731-1369"]
[null,null,"46-3107-0065"]
[null,null,"46-3115-0608"]
[null,null,"46-3307-0205"]
[null,null,"46-3386-0205"]
[null,null,"46-3411-0235"]
[null,null,"46-3414-0455"]
[null,null,"46-3515-0456"]
[null,null,"46-3516-0529"]
[null,null,"46-3615-0494"]
[null,null,"47-4334-5604"]
[null,null,"47-4334-5605"]
[null,null,"47-4334-5606"]
[null,null,"47-4334-5607"]
[null,null,"47-5715-5563"]
[null,null,"47-5715-5564"]
[null,null,"47-5715-5565"]
[null,null,"47-7053-2912"]
[null,null,"47-7053-2913"]
[null,null,"47-7147-2748"]
[null,null,"47-7147-2749"]
[null,null,"48-0056-2743"]
[null,null,"48-0164-2636"]
[null,null,"48-0201-2636"]
[null,null,"48-0354-3143"]
[null,null,"48-0355-2884"]
[null,null,"48-0355-2885"]
[null,null,"48-0691-0396"]
[null,null,"48-1010-2760"]
[null,null,"48-1063-2335"]
[null,null,"48-1088-0635"]
[null,null,"48-1089-0635"]
[null,null,"48-1089-0636"]
[null,null,"48-1241-1633"]
[null,null,"48-1241-1634"]
[null,null,"48-1241-1692"]
[null,null,"48-3343-1920"]
[null,null,"48-3748-2932"]
[null,null,"48-3792-2733"]
[null,null,"48-4495-1002"]
[null,null,"48-4500-2418"]
[null,null,"48-4500-2419"]
[null,null,"48-4592-3106"]
[null,null,"48-4592-3139"]
[null,null,"48-4602-3027"]
[null,null,"48-4679-3032"]
[null,null,"48-4681-3031"]
[null,null,"48-4888-2853"]
[null,null,"48-4888-2854"]
[null,null,"49-0003-1481"]
[null,null,"49-0003-1482"]
[null,null,"49-0003-1483"]
[null,null,"49-0025-2089"]
[null,null,"49-0086-1888"]
[null,null,"49-0098-0282"]
[null,null,"49-0098-0283"]
[null,null,"49-0102-0278"]
[null,null,"49-0102-0279"]
[null,null,"49-0171-1086"]
[null,null,"49-0200-1064"]
[null,null,"49-0200-1065"]
[null,null,"49-0200-1276"]
[null,null,"49-0200-1277"]
[null,null,"49-0200-1278"]
[null,null,"49-0216-0083"]
[null,null,"49-0217-0084"]
[null,null,"49-0223-0484"]
[null,null,"49-0325-0886"]
[null,null,"49-0326-0886"]
[null,null,"49-0500-1571"]
[null,null,"49-0501-0568"]
[null,null,"49-0518-1789"]
[null,null,"49-0519-1789"]
[null,null,"49-0520-1789"]
[null,null,"49-0523-1488"]
[null,null,"49-0600-1095"]
[null,null,"49-0600-1096"]
[null,null,"49-0752-2090"]
[null,null,"49-0802-0064"]
[null,null,"49-0802-2388"]
[null,null,"49-0802-2389"]
[null,null,"49-0860-2291"]
[null,null,"49-0941-0089"]
[null,null,"49-0986-0990"]
[null,null,"49-0986-0991"]
[null,null,"49-0988-0990"]
[null,null,"49-0989-0991"]
[null,null,"49-0990-0991"]
[null,null,"49-1007-0389"]
[null,null,"49-1097-0767"]
[null,null,"49-1097-0768"]
[null,null,"49-1097-1121"]
[null,null,"49-1097-1122"]
[null,null,"49-1098-0959"]
[null,null,"49-1166-1592"]
[null,null,"49-1166-1593"]
[null,null,"49-1191-1692"]
[null,null,"49-1192-1692"]
[null,null,"49-1196-0504"]
[null,null,"49-1196-0505"]
[null,null,"49-1197-1454"]
[null,null,"49-1197-1455"]
[null,null,"49-1197-1456"]
[null,null,"49-1229-0690"]
[null,null,"49-1230-0690"]
[null,null,"49-1231-0690"]
[null,null,"49-1232-0690"]
[null,null,"49-1243-1893"]
[null,null,"49-1243-1894"]
[null,null,"49-1254-0490"]
[null,null,"49-1255-1993"]
[null,null,"49-1276-0691"]
[null,null,"49-1277-0691"]
[null,null,"49-1278-0691"]
[null,null,"49-1280-1693"]
[null,null,"49-1283-2094"]
[null,null,"49-1285-0390"]
[null,null,"49-1294-1693"]
[null,null,"49-1296-1411"]
[null,null,"49-1296-1412"]
[null,null,"49-1296-1462"]
[null,null,"49-1298-1697"]
[null,null,"49-1298-1791"]
[null,null,"49-1298-1792"]
[null,null,"49-1300-2039"]
[null,null,"49-1300-2187"]
[null,null,"49-1300-2188"]
[null,null,"49-1300-2189"]
[null,null,"49-1300-2269"]
[null,null,"49-1300-2270"]
[null,null,"49-1308-1693"]
[null,null,"49-1355-1994"]
[null,null,"49-1394-1029"]
[null,null,"49-1394-1030"]
[null,null,"49-1395-1321"]
[null,null,"49-1395-1322"]
[null,null,"49-1395-1323"]
[null,null,"49-1397-1646"]
[null,null,"49-1397-1647"]
[null,null,"49-1397-1648"]
[null,null,"49-1398-1711"]
[null,null,"49-1399-1979"]
[null,null,"49-1400-2138"]
[null,null,"49-1400-2209"]
[null,null,"49-1400-2210"]
[null,null,"49-1401-2365"]
[null,null,"49-1527-0492"]
[null,null,"49-1528-0492"]
[null,null,"49-1528-0493"]
[null,null,"49-1548-0292"]
[null,null,"49-1557-0693"]
[null,null,"49-1558-0693"]
[null,null,"49-1583-0493"]
[null,null,"49-1597-2139"]
[null,null,"49-1598-2139"]
[null,null,"49-1599-2321"]
[null,null,"49-1613-0693"]
[null,null,"49-1613-0694"]
[null,null,"49-1642-1395"]
[null,null,"49-1644-1095"]
[null,null,"49-1647-1095"]
[null,null,"49-1648-1095"]
[null,null,"49-1662-0493"]
[null,null,"49-1687-0122"]
[null,null,"49-1687-0123"]
[null,null,"49-1690-0516"]
[null,null,"49-1691-0515"]
[null,null,"49-1693-1075"]
[null,null,"49-1693-1076"]
[null,null,"49-1693-1077"]
[null,null,"49-1693-1078"]
[null,null,"49-1728-0091"]
[null,null,"49-1765-0493"]
[null,null,"49-1765-0494"]
[null,null,"49-1770-0292"]
[null,null,"49-1790-0480"]
[null,null,"49-1790-0481"]
[null,null,"49-1797-1648"]
[null,null,"49-1888-1596"]
[null,null,"49-1890-0693"]
[null,null,"49-1890-0694"]
[null,null,"49-1896-0392"]
[null,null,"49-1943-0694"]
[null,null,"49-1977-2397"]
[null,null,"49-1978-2396"]
[null,null,"49-1992-1095"]
[null,null,"49-1993-1095"]
[null,null,"49-2031-1496"]
[null,null,"49-2032-1496"]
[null,null,"49-2061-0794"]
[null,null,"49-2063-2097"]
[null,null,"49-2064-1796"]
[null,null,"49-2064-2097"]
[null,null,"49-2066-1796"]
[null,null,"49-2067-1896"]
[null,null,"49-2067-1897"]
[null,null,"49-2067-1898"]
[null,null,"49-2072-0092"]
[null,null,"49-2080-0092"]
[null,null,"49-2081-1996"]
[null,null,"49-2081-1997"]
[null,null,"49-2097-1811"]
[null,null,"49-2097-1812"]
[null,null,"49-2097-1813"]
[null,null,"49-2098-1901"]
[null,null,"49-2098-1902"]
[null,null,"49-2099-1937"]
[null,null,"49-2099-1938"]
[null,null,"49-2101-2297"]
[null,null,"49-2103-2293"]
[null,null,"49-2105-1896"]
[null,null,"49-2105-1897"]
[null,null,"49-2156-0086"]
[null,null,"49-2160-0091"]
[null,null,"49-2160-0092"]
[null,null,"49-2161-0091"]
[null,null,"49-2199-1596"]
[null,null,"49-2280-2097"]
[null,null,"49-2282-0392"]
[null,null,"49-2282-0393"]
[null,null,"49-2283-0392"]
[null,null,"49-2283-0393"]
[null,null,"49-2283-0394"]
[null,null,"49-2283-0395"]
[null,null,"49-2284-0392"]
[null,null,"49-2288-0712"]
[null,null,"49-2288-0713"]
[null,null,"49-2319-0092"]
[null,null,"49-2326-2197"]
[null,null,"49-2327-2197"]
[null,null,"49-2327-2198"]
[null,null,"49-2340-2297"]
[null,null,"49-2341-2297"]
[null,null,"49-2341-2298"]
[null,null,"49-2350-1797"]
[null,null,"49-2350-1798"]
[null,null,"49-2386-0441"]
[null,null,"49-2396-1820"]
[null,null,"49-2396-1896"]
[null,null,"49-2396-1897"]
[null,null,"49-2396-1898"]
[null,null,"49-2397-1820"]
[null,null,"49-2397-1877"]
[null,null,"49-2397-1893"]
[null,null,"50-0001-0940"]
[null,null,"50-0001-1477"]
[null,null,"50-0002-0151"]
[null,null,"50-0015-1413"]
[null,null,"50-0015-1414"]
[null,null,"50-0034-1413"]
[null,null,"50-0055-1412"]
[null,null,"50-0061-1312"]
[null,null,"50-0062-2217"]
[null,null,"50-0097-2316"]
[null,null,"50-0099-0421"]
[null,null,"50-0099-0678"]
[null,null,"50-0100-0421"]
[null,null,"50-0101-1373"]
[null,null,"50-0101-1457"]
[null,null,"50-0106-2417"]
[null,null,"50-0106-2418"]
[null,null,"50-0106-2419"]
[null,null,"50-0161-2316"]
[null,null,"50-0198-0710"]
[null,null,"50-0199-0326"]
[null,null,"50-0199-0327"]
[null,null,"50-0199-0652"]
[null,null,"50-0199-0653"]
[null,null,"50-0201-2351"]
[null,null,"50-0293-0508"]
[null,null,"50-0293-0509"]
[null,null,"50-0293-0510"]
[null,null,"50-0302-1977"]
[null,null,"50-0302-1978"]
[null,null,"50-0303-0010"]
[null,null,"50-0303-0011"]
[null,null,"50-0329-1612"]
[null,null,"50-0348-0708"]
[null,null,"50-0348-0709"]
[null,null,"50-0358-2316"]
[null,null,"50-0359-2316"]
[null,null,"50-0398-0073"]
[null,null,"50-0398-0074"]
[null,null,"50-0398-0075"]
[null,null,"50-0401-2039"]
[null,null,"50-0403-2416"]
[null,null,"50-0403-2417"]
[null,null,"50-0443-1713"]
[null,null,"50-0495-1111"]
[null,null,"50-0495-1112"]
[null,null,"50-0497-0997"]
[null,null,"50-0500-0559"]
[null,null,"50-0500-0560"]
[null,null,"50-0532-2316"]
[null,null,"50-0604-0808"]
[null,null,"50-0604-0809"]
[null,null,"50-0615-0507"]
[null,null,"50-0653-1110"]
[null,null,"50-0657-1713"]
[null,null,"50-0686-0909"]
[null,null,"50-0697-1787"]
[null,null,"50-0697-1788"]
[null,null,"50-0697-1789"]
[null,null,"50-0756-1210"]
[null,null,"50-0756-1211"]
[null,null,"50-0768-0207"]
[null,null,"50-0777-0709"]
[null,null,"50-0780-1110"]
[null,null,"50-0783-0910"]
[null,null,"50-0793-0727"]
[null,null,"50-0795-0990"]
[null,null,"50-0796-1139"]
[null,null,"50-0797-1798"]
[null,null,"50-0797-1799"]
[null,null,"50-0799-2190"]
[null,null,"50-0878-0208"]
[null,null,"50-0878-0209"]
[null,null,"50-0891-0244"]
[null,null,"50-0891-0245"]
[null,null,"50-0892-0596"]
[null,null,"50-0893-0774"]
[null,null,"50-0893-0775"]
[null,null,"50-0894-0888"]
[null,null,"50-0896-1367"]
[null,null,"50-0919-0609"]
[null,null,"50-0919-0810"]
[null,null,"50-0919-0811"]
[null,null,"50-0922-1712"]
[null,null,"50-0939-0309"]
[null,null,"50-0939-0310"]
[null,null,"50-0941-1311"]
[null,null,"50-0955-0910"]
[null,null,"50-0960-1812"]
[null,null,"50-0960-1813"]
[null,null,"50-0979-2415"]
[null,null,"50-0979-2416"]
[null,null,"50-0986-0509"]
[null,null,"50-0986-0510"]
[null,null,"50-0990-2415"]
[null,null,"50-0990-2416"]
[null,null,"50-0996-1699"]
[null,null,"50-0996-1700"]
[null,null,"50-1001-2415"]
[null,null,"50-1016-0309"]
[null,null,"50-1016-0310"]
[null,null,"50-1053-1511"]
[null,null,"50-1053-1512"]
[null,null,"50-1071-1211"]
[null,null,"50-1071-1212"]
[null,null,"50-1092-0579"]
[null,null,"50-1092-0580"]
[null,null,"50-1092-0620"]
[null,null,"50-1095-1296"]
[null,null,"50-1098-2204"]
[null,null,"50-1098-2205"]
[null,null,"50-1098-2206"]
[null,null,"50-1169-0510"]
[null,null,"50-1169-0511"]
[null,null,"50-1177-0911"]
[null,null,"50-1177-0912"]
[null,null,"50-1185-1311"]
[null,null,"50-1190-1061"]
[null,null,"50-1190-1062"]
[null,null,"50-1191-0433"]
[null,null,"50-1191-0434"]
[null,null,"50-1191-0435"]
[null,null,"50-1191-0464"]
[null,null,"50-1191-0465"]
[null,null,"50-1191-0466"]
[null,null,"50-1191-0477"]
[null,null,"50-1191-0478"]
[null,null,"50-1191-0479"]
[null,null,"50-1197-1311"]
[null,null,"50-1197-1312"]
[null,null,"50-1197-1950"]
[null,null,"50-1243-2213"]
[null,null,"50-1287-0039"]
[null,null,"50-1293-1517"]
[null,null,"50-1297-2180"]
[null,null,"50-1297-2181"]
[null,null,"50-1319-0109"]
[null,null,"50-1322-2188"]
[null,null,"50-1322-2189"]
[null,null,"50-1347-2192"]
[null,null,"50-1347-2193"]
[null,null,"50-1347-2194"]
[null,null,"50-1347-2195"]
[null,null,"50-1362-1512"]
[null,null,"50-1362-1513"]
[null,null,"50-1371-1612"]
[null,null,"50-1371-1613"]
[null,null,"50-1387-0476"]
[null,null,"50-1387-0477"]
[null,null,"50-1391-0911"]
[null,null,"50-1391-0912"]
[null,null,"50-1392-0861"]
[null,null,"50-1392-0862"]
[null,null,"50-1394-1812"]
[null,null,"50-1395-1814"]
[null,null,"50-1395-1815"]
[null,null,"50-1395-1830"]
[null,null,"50-1395-1831"]
[null,null,"50-1395-1843"]
[null,null,"50-1395-1844"]
[null,null,"50-1395-1845"]
[null,null,"50-1395-1846"]
[null,null,"50-1397-0311"]
[null,null,"50-1397-0312"]
[null,null,"50-1401-0811"]
[null,null,"50-1401-0812"]
[null,null,"50-1433-0911"]
[null,null,"50-1437-0378"]
[null,null,"50-1437-0379"]
[null,null,"50-1444-0085"]
[null,null,"50-1444-0086"]
[null,null,"50-1444-0087"]
[null,null,"50-1450-0106"]
[null,null,"50-1450-0107"]
[null,null,"50-1450-0108"]
[null,null,"50-1473-0711"]
[null,null,"50-1473-0712"]
[null,null,"50-1487-0382"]
[null,null,"50-1488-0009"]
[null,null,"50-1488-0010"]
[null,null,"50-1489-0898"]
[null,null,"50-1489-0899"]
[null,null,"50-1491-1169"]
[null,null,"50-1491-1170"]
[null,null,"50-1491-1189"]
[null,null,"50-1491-1381"]
[null,null,"50-1491-1382"]
[null,null,"50-1492-0138"]
[null,null,"50-1492-1484"]
[null,null,"50-1493-1530"]
[null,null,"50-1524-1112"]
[null,null,"50-1524-1113"]
[null,null,"50-1524-1114"]
[null,null,"50-1527-1811"]
[null,null,"50-1527-1812"]
[null,null,"50-1527-1813"]
[null,null,"50-1563-0811"]
[null,null,"50-1648-1211"]
[null,null,"50-1648-1212"]
[null,null,"50-1654-1111"]
[null,null,"50-1654-1112"]
[null,null,"50-1658-0711"]
[null,null,"50-1667-1311"]
[null,null,"50-1667-1312"]
[null,null,"50-1686-1511"]
[null,null,"50-1687-0086"]
[null,null,"50-1687-0087"]
[null,null,"50-1687-0149"]
[null,null,"50-1687-0350"]
[null,null,"50-1687-0351"]
[null,null,"50-1687-0429"]
[null,null,"50-1688-0548"]
[null,null,"50-1688-0643"]
[null,null,"50-1688-0736"]
[null,null,"50-1688-0737"]
[null,null,"50-1688-0783"]
[null,null,"50-1689-0985"]
[null,null,"50-1690-1137"]
[null,null,"50-1690-1138"]
[null,null,"50-1702-0110"]
[null,null,"50-1702-0111"]
[null,null,"50-1787-0259"]
[null,null,"50-1787-0438"]
[null,null,"50-1788-0198"]
[null,null,"50-1788-0199"]
[null,null,"50-1788-0577"]
[null,null,"50-1788-0578"]
[null,null,"50-1836-0812"]
[null,null,"50-1837-0711"]
[null,null,"50-1837-0712"]
[null,null,"50-1838-0728"]
[null,null,"50-1838-0729"]
[null,null,"50-1838-0730"]
[null,null,"50-1857-0872"]
[null,null,"50-1858-1310"]
[null,null,"50-1887-0574"]
[null,null,"50-1887-0575"]
[null,null,"50-1887-0576"]
[null,null,"50-1887-0577"]
[null,null,"50-1887-0578"]
[null,null,"50-1887-0579"]
[null,null,"50-1887-0610"]
[null,null,"50-1887-0611"]
[null,null,"50-1889-1051"]
[null,null,"50-1889-1147"]
[null,null,"50-1889-1220"]
[null,null,"50-1890-1269"]
[null,null,"50-1893-0362"]
[null,null,"50-1904-1061"]
[null,null,"50-1910-0286"]
[null,null,"50-1910-0287"]
[null,null,"50-1944-0009"]
[null,null,"50-1944-0010"]
[null,null,"50-1949-0225"]
[null,null,"50-1949-0710"]
[null,null,"50-1952-0108"]
[null,null,"50-1952-0109"]
[null,null,"50-1966-1610"]
[null,null,"50-1966-1611"]
[null,null,"50-1974-0861"]
[null,null,"50-1974-0862"]
[null,null,"50-1992-1351"]
[null,null,"50-2001-1111"]
[null,null,"50-2002-1211"]
[null,null,"50-2003-1311"]
[null,null,"50-2035-0710"]
[null,null,"50-2046-1511"]
[null,null,"50-2098-0009"]
[null,null,"50-2098-0010"]
[null,null,"50-2122-0813"]
[null,null,"50-2140-1211"]
[null,null,"50-2167-0238"]
[null,null,"50-2167-0239"]
[null,null,"50-2187-0910"]
[null,null,"50-2188-0667"]
[null,null,"50-2189-0795"]
[null,null,"50-2189-0796"]
[null,null,"50-2189-1095"]
[null,null,"50-2190-1185"]
[null,null,"50-2191-0238"]
[null,null,"50-2196-0367"]
[null,null,"50-2196-0368"]
[null,null,"50-2205-0810"]
[null,null,"50-2206-0911"]
[null,null,"50-2208-0113"]
[null,null,"50-2208-0114"]
[null,null,"50-2208-0115"]
[null,null,"50-2220-0512"]
[null,null,"50-2220-0513"]
[null,null,"50-2220-0514"]
[null,null,"50-2236-1311"]
[null,null,"50-2277-0315"]
[null,null,"50-2287-1311"]
[null,null,"50-2289-0791"]
[null,null,"50-2289-0792"]
[null,null,"50-2290-1470"]
[null,null,"50-2299-1211"]
[null,null,"50-2303-0183"]
[null,null,"50-2304-0810"]
[null,null,"50-2304-0811"]
[null,null,"50-2312-0316"]
[null,null,"50-2322-1111"]
[null,null,"50-2322-1112"]
[null,null,"50-2348-0810"]
[null,null,"50-2355-1311"]
[null,null,"50-2361-1311"]
[null,null,"50-2369-0312"]
[null,null,"50-2372-1111"]
[null,null,"50-2372-1112"]
[null,null,"50-2378-1311"]
[null,null,"50-2462-0217"]
[null,null,"50-2462-0218"]
[null,null,"50-2465-0267"]
[null,null,"50-2465-0268"]
[null,null,"50-2489-1484"]
[null,null,"50-2537-0911"]
[null,null,"50-2539-1111"]
[null,null,"50-2539-1112"]
[null,null,"50-2569-0170"]
[null,null,"50-2569-0171"]
[null,null,"50-2572-0274"]
[null,null,"50-2572-0275"]
[null,null,"50-2572-1510"]
[null,null,"50-2572-1511"]
[null,null,"50-2573-0299"]
[null,null,"50-2573-0300"]
[null,null,"50-2579-0085"]
[null,null,"50-2579-0086"]
[null,null,"50-2586-1212"]
[null,null,"50-2587-0800"]
[null,null,"50-2588-1543"]
[null,null,"50-2588-1544"]
[null,null,"50-2589-1207"]
[null,null,"50-2589-1354"]
[null,null,"50-2589-1355"]
[null,null,"50-2591-1154"]
[null,null,"50-2591-1912"]
[null,null,"50-2593-1024"]
[null,null,"50-2593-1025"]
[null,null,"50-2600-1112"]
[null,null,"50-2600-1113"]
[null,null,"50-2604-0710"]
[null,null,"50-2604-0711"]
[null,null,"50-2607-0811"]
[null,null,"50-2607-0813"]
[null,null,"50-2620-1312"]
[null,null,"50-2646-0310"]
[null,null,"50-2648-0310"]
[null,null,"50-2681-0295"]
[null,null,"50-2681-0296"]
[null,null,"50-2682-0308"]
[null,null,"50-2682-0309"]
[null,null,"50-2682-0310"]
[null,null,"50-2682-0311"]
[null,null,"50-2682-0408"]
[null,null,"50-2682-0545"]
[null,null,"50-2682-0546"]
[null,null,"50-2688-0910"]
[null,null,"50-2688-0911"]
[null,null,"50-2689-1043"]
[null,null,"50-2689-1385"]
[null,null,"50-2689-1386"]
[null,null,"50-2689-1488"]
[null,null,"50-2689-1489"]
[null,null,"50-2718-0311"]
[null,null,"50-2721-2012"]
[null,null,"50-2751-0811"]
[null,null,"50-2777-1366"]
[null,null,"50-2778-0461"]
[null,null,"50-2778-0462"]
[null,null,"50-2778-0463"]
[null,null,"50-2778-0464"]
[null,null,"50-2782-0461"]
[null,null,"50-2783-1113"]
[null,null,"50-2791-1214"]
[null,null,"50-2791-1215"]
[null,null,"50-2791-1216"]
[null,null,"50-2796-0811"]
[null,null,"50-2799-1520"]
[null,null,"50-2828-0912"]
[null,null,"50-2828-0913"]
[null,null,"50-2842-1612"]
[null,null,"50-2863-0711"]
[null,null,"50-2863-0712"]
[null,null,"50-2885-0725"]
[null,null,"50-2885-0726"]
[null,null,"50-2889-1333"]
[null,null,"50-2889-1366"]
[null,null,"50-2889-1367"]
[null,null,"50-2889-1368"]
[null,null,"50-2889-1594"]
[null,null,"50-2889-1595"]
[null,null,"50-2897-0913"]
[null,null,"50-2905-0510"]
[null,null,"50-2905-0511"]
[null,null,"50-2935-0712"]
[null,null,"50-2935-0713"]
[null,null,"50-2951-2313"]
[null,null,"50-2955-1713"]
[null,null,"50-2955-1714"]
[null,null,"50-2989-0817"]
[null,null,"50-2995-0210"]
[null,null,"50-3000-0310"]
[null,null,"50-3006-1115"]
[null,null,"50-3023-2011"]
[null,null,"50-3058-1214"]
[null,null,"50-3061-1613"]
[null,null,"50-3088-1075"]
[null,null,"50-3089-1784"]
[null,null,"50-3091-2209"]
[null,null,"50-3092-1952"]
[null,null,"50-3105-0812"]
[null,null,"50-3112-0507"]
[null,null,"50-3130-2314"]
[null,null,"50-3130-2315"]
[null,null,"50-3139-1904"]
[null,null,"50-3139-1905"]
[null,null,"50-3149-1016"]
[null,null,"50-3149-1017"]
[null,null,"50-3167-0507"]
[null,null,"50-3188-2288"]
[null,null,"50-3188-2289"]
[null,null,"50-3192-1923"]
[null,null,"50-3198-0303"]
[null,null,"50-3198-0304"]
[null,null,"50-3204-1511"]
[null,null,"50-3204-1512"]
[null,null,"50-3211-2312"]
[null,null,"50-3234-1897"]
[null,null,"50-3241-0100"]
[null,null,"50-3241-0101"]
[null,null,"50-3241-0102"]
[null,null,"50-3241-0103"]
[null,null,"50-3254-1710"]
[null,null,"50-3254-1711"]
[null,null,"50-3254-2311"]
[null,null,"50-3254-2312"]
[null,null,"50-3281-2112"]
[null,null,"50-3288-1461"]
[null,null,"50-3288-1548"]
[null,null,"50-3312-0707"]
[null,null,"50-3316-1509"]
[null,null,"50-3316-1510"]
[null,null,"50-3327-1308"]
[null,null,"50-3327-1309"]
[null,null,"50-3332-1207"]
[null,null,"50-3332-1208"]
[null,null,"50-3348-2111"]
[null,null,"50-3348-2112"]
[null,null,"50-3353-2311"]
[null,null,"50-3353-2312"]
[null,null,"50-3358-0704"]
[null,null,"50-3366-2008"]
[null,null,"50-3366-2009"]
[null,null,"50-3366-2010"]
[null,null,"50-3378-1206"]
[null,null,"50-3383-1786"]
[null,null,"50-3383-1799"]
[null,null,"50-3389-2346"]
[null,null,"51-0002-0452"]
[null,null,"51-0002-0503"]
[null,null,"51-0002-0640"]
[null,null,"51-0002-2032"]
[null,null,"51-0003-0639"]
[null,null,"51-0003-0751"]
[null,null,"51-0010-2007"]
[null,null,"51-0019-0703"]
[null,null,"51-0030-1907"]
[null,null,"51-0080-1706"]
[null,null,"51-0084-1706"]
[null,null,"51-0102-1707"]
[null,null,"51-0108-0704"]
[null,null,"51-0120-1707"]
[null,null,"51-0135-1706"]
[null,null,"51-0137-0705"]
[null,null,"51-0138-0505"]
[null,null,"51-0149-0605"]
[null,null,"51-0152-0405"]
[null,null,"51-0153-2284"]
[null,null,"51-0153-2285"]
[null,null,"51-0153-2286"]
[null,null,"51-0197-0244"]
[null,null,"51-0197-0286"]
[null,null,"51-0197-0287"]
[null,null,"51-0197-0289"]
[null,null,"51-0197-0368"]
[null,null,"51-0197-0387"]
[null,null,"51-0197-0535"]
[null,null,"51-0198-0404"]
[null,null,"51-0200-1614"]
[null,null,"51-0202-2322"]
[null,null,"51-0202-2323"]
[null,null,"51-0202-2324"]
[null,null,"51-0202-2325"]
[null,null,"51-0209-0606"]
[null,null,"51-0227-0705"]
[null,null,"51-0228-1605"]
[null,null,"51-0231-1206"]
[null,null,"51-0239-0606"]
[null,null,"51-0260-0705"]
[null,null,"51-0283-2207"]
[null,null,"51-0297-1605"]
[null,null,"51-0297-1606"]
[null,null,"51-0298-1595"]
[null,null,"51-0298-1617"]
[null,null,"51-0298-1618"]
[null,null,"51-0298-1640"]
[null,null,"51-0298-2308"]
[null,null,"51-0299-0405"]
[null,null,"51-0300-1770"]
[null,null,"51-0316-0203"]
[null,null,"51-0327-0106"]
[null,null,"51-0328-0106"]
[null,null,"51-0360-2207"]
[null,null,"51-0380-0205"]
[null,null,"51-0388-0405"]
[null,null,"51-0398-0286"]
[null,null,"51-0398-0631"]
[null,null,"51-0399-0375"]
[null,null,"51-0399-1065"]
[null,null,"51-0443-2207"]
[null,null,"51-0452-0506"]
[null,null,"51-0480-0207"]
[null,null,"51-0480-0208"]
[null,null,"51-0481-0606"]
[null,null,"51-0492-0507"]
[null,null,"51-0500-2017"]
[null,null,"51-0508-0406"]
[null,null,"51-0515-0807"]
[null,null,"51-0538-0707"]
[null,null,"51-0549-0806"]
[null,null,"51-0595-0242"]
[null,null,"51-0596-0106"]
[null,null,"51-0598-0789"]
[null,null,"51-0598-2307"]
[null,null,"51-0599-1083"]
[null,null,"51-0599-1088"]
[null,null,"51-0599-1108"]
[null,null,"51-0599-1656"]
[null,null,"51-0599-1670"]
[null,null,"51-0616-1105"]
[null,null,"51-0622-2408"]
[null,null,"51-0631-0805"]
[null,null,"51-0687-2207"]
[null,null,"51-0689-0803"]
[null,null,"51-0691-0354"]
[null,null,"51-0692-0411"]
[null,null,"51-0693-0425"]
[null,null,"51-0693-0458"]
[null,null,"51-0694-0459"]
[null,null,"51-0697-0670"]
[null,null,"51-0698-1276"]
[null,null,"51-0698-1318"]
[null,null,"51-0699-0815"]
[null,null,"51-0700-1358"]
[null,null,"51-0700-1646"]
[null,null,"51-0700-1691"]
[null,null,"51-0700-1845"]
[null,null,"51-0700-1846"]
[null,null,"51-0700-1847"]
[null,null,"51-0701-1586"]
[null,null,"51-0702-2212"]
[null,null,"51-0707-1353"]
[null,null,"51-0708-1706"]
[null,null,"51-0710-0705"]
[null,null,"51-0715-1605"]
[null,null,"51-0719-0205"]
[null,null,"51-0719-0206"]
[null,null,"51-0757-2207"]
[null,null,"51-0760-0803"]
[null,null,"51-0769-0206"]
[null,null,"51-0776-1104"]
[null,null,"51-0779-0407"]
[null,null,"51-0786-0904"]
[null,null,"51-0787-0704"]
[null,null,"51-0792-0229"]
[null,null,"51-0792-0285"]
[null,null,"51-0797-0704"]
[null,null,"51-0801-1606"]
[null,null,"51-0810-0705"]
[null,null,"51-0818-0804"]
[null,null,"51-0826-1105"]
[null,null,"51-0835-2308"]
[null,null,"51-0839-1606"]
[null,null,"51-0851-1105"]
[null,null,"51-0861-0704"]
[null,null,"51-0861-1206"]
[null,null,"51-0861-1207"]
[null,null,"51-0862-2208"]
[null,null,"51-0866-2308"]
[null,null,"51-0871-0804"]
[null,null,"51-0872-0904"]
[null,null,"51-0878-1707"]
[null,null,"51-0881-1607"]
[null,null,"51-0888-1207"]
[null,null,"51-0891-0385"]
[null,null,"51-0891-0386"]
[null,null,"51-0891-0387"]
[null,null,"51-0894-0904"]
[null,null,"51-0896-0919"]
[null,null,"51-0896-1023"]
[null,null,"51-0896-1043"]
[null,null,"51-0896-1083"]
[null,null,"51-0896-1122"]
[null,null,"51-0896-1226"]
[null,null,"51-0896-1358"]
[null,null,"51-0896-1402"]
[null,null,"51-0896-1449"]
[null,null,"51-0896-1450"]
[null,null,"51-0897-0105"]
[null,null,"51-0897-0106"]
[null,null,"51-0897-0107"]
[null,null,"51-0897-0949"]
[null,null,"51-0897-1023"]
[null,null,"51-0897-1181"]
[null,null,"51-0897-1206"]
[null,null,"51-0897-1226"]
[null,null,"51-0897-1356"]
[null,null,"51-0897-1512"]
[null,null,"51-0898-0104"]
[null,null,"51-0899-1558"]
[null,null,"51-0899-1566"]
[null,null,"51-0899-1581"]
[null,null,"51-0899-1607"]
[null,null,"51-0899-1751"]
[null,null,"51-0900-1605"]
[null,null,"51-0900-1612"]
[null,null,"51-0900-1814"]
[null,null,"51-0900-1886"]
[null,null,"51-0900-1907"]
[null,null,"51-0900-1908"]
[null,null,"51-0901-1906"]
[null,null,"51-0901-1907"]
[null,null,"51-0901-2041"]
[null,null,"51-0901-2048"]
[null,null,"51-0901-2209"]
[null,null,"51-0901-2228"]
[null,null,"51-0902-2111"]
[null,null,"51-0902-2112"]
[null,null,"51-0902-2120"]
[null,null,"51-0902-2152"]
[null,null,"51-0902-2268"]
[null,null,"51-0902-2277"]
[null,null,"51-0902-2364"]
[null,null,"51-0902-2395"]
[null,null,"51-0903-2383"]
[null,null,"51-0908-2407"]
[null,null,"51-0913-1105"]
[null,null,"51-0926-1207"]
[null,null,"51-0927-1105"]
[null,null,"51-0949-0803"]
[null,null,"51-0949-0904"]
[null,null,"51-0959-1104"]
[null,null,"51-0961-0507"]
[null,null,"51-0964-2308"]
[null,null,"51-0972-1707"]
[null,null,"51-0972-1708"]
[null,null,"51-0974-0406"]
[null,null,"51-0975-0507"]
[null,null,"51-0975-0508"]
[null,null,"51-0976-0406"]
[null,null,"51-0976-0407"]
[null,null,"51-0976-1207"]
[null,null,"51-0980-0903"]
[null,null,"51-0983-0507"]
[null,null,"51-0990-0099"]
[null,null,"51-0995-1324"]
[null,null,"51-0996-1282"]
[null,null,"51-0996-1352"]
[null,null,"51-0997-1018"]
[null,null,"51-0997-1032"]
[null,null,"51-0997-1117"]
[null,null,"51-0997-1139"]
[null,null,"51-0997-1203"]
[null,null,"51-0998-1249"]
[null,null,"51-1007-0804"]
[null,null,"51-1016-0290"]
[null,null,"51-1016-0291"]
[null,null,"51-1017-1206"]
[null,null,"51-1043-1207"]
[null,null,"51-1053-1106"]
[null,null,"51-1057-0804"]
[null,null,"51-1061-1607"]
[null,null,"51-1062-1207"]
[null,null,"51-1064-0104"]
[null,null,"51-1066-0905"]
[null,null,"51-1079-0104"]
[null,null,"51-1084-1206"]
[null,null,"51-1086-1107"]
[null,null,"51-1088-1607"]
[null,null,"51-1092-0078"]
[null,null,"51-1092-0340"]
[null,null,"51-1093-0340"]
[null,null,"51-1095-0835"]
[null,null,"51-1095-0985"]
[null,null,"51-1095-1088"]
[null,null,"51-1095-1096"]
[null,null,"51-1095-1148"]
[null,null,"51-1095-1347"]
[null,null,"51-1096-0868"]
[null,null,"51-1096-0880"]
[null,null,"51-1096-1095"]
[null,null,"51-1096-1108"]
[null,null,"51-1096-1131"]
[null,null,"51-1096-1200"]
[null,null,"51-1096-1347"]
[null,null,"51-1096-1606"]
[null,null,"51-1097-0906"]
[null,null,"51-1097-1207"]
[null,null,"51-1097-1645"]
[null,null,"51-1098-0905"]
[null,null,"51-1098-1682"]
[null,null,"51-1098-1906"]
[null,null,"51-1099-1703"]
[null,null,"51-1099-1830"]
[null,null,"51-1099-1906"]
[null,null,"51-1100-1921"]
[null,null,"51-1100-1922"]
[null,null,"51-1104-1607"]
[null,null,"51-1109-1207"]
[null,null,"51-1114-1307"]
[null,null,"51-1117-0506"]
[null,null,"51-1142-2248"]
[null,null,"51-1143-2208"]
[null,null,"51-1146-1557"]
[null,null,"51-1147-1907"]
[null,null,"51-1154-0805"]
[null,null,"51-1157-1957"]
[null,null,"51-1158-1307"]
[null,null,"51-1160-0905"]
[null,null,"51-1171-1607"]
[null,null,"51-1178-0906"]
[null,null,"51-1188-0807"]
[null,null,"51-1194-0807"]
[null,null,"51-1194-0906"]
[null,null,"51-1196-1907"]
[null,null,"51-1196-1908"]
[null,null,"51-1197-0907"]
[null,null,"51-1197-1957"]
[null,null,"51-1216-0907"]
[null,null,"51-1233-0106"]
[null,null,"51-1233-0107"]
[null,null,"51-1240-0607"]
[null,null,"51-1240-0906"]
[null,null,"51-1246-1607"]
[null,null,"51-1246-1608"]
[null,null,"51-1248-1807"]
[null,null,"51-1253-2028"]
[null,null,"51-1254-2043"]
[null,null,"51-1262-1908"]
[null,null,"51-1269-0613"]
[null,null,"51-1280-0906"]
[null,null,"51-1280-1808"]
[null,null,"51-1281-1407"]
[null,null,"51-1289-0606"]
[null,null,"51-1289-1607"]
[null,null,"51-1290-0132"]
[null,null,"51-1292-0366"]
[null,null,"51-1292-0405"]
[null,null,"51-1292-0415"]
[null,null,"51-1293-0406"]
[null,null,"51-1294-0889"]
[null,null,"51-1295-0832"]
[null,null,"51-1295-0851"]
[null,null,"51-1298-1470"]
[null,null,"51-1299-1470"]
[null,null,"51-1299-1495"]
[null,null,"51-1299-1574"]
[null,null,"51-1299-1575"]
[null,null,"51-1299-1642"]
[null,null,"51-1301-1712"]
[null,null,"51-1301-1713"]
[null,null,"51-1301-1808"]
[null,null,"51-1303-1904"]
[null,null,"51-1303-2332"]
[null,null,"51-1308-0804"]
[null,null,"51-1312-0905"]
[null,null,"51-1327-0905"]
[null,null,"51-1331-0805"]
[null,null,"51-1335-1909"]
[null,null,"51-1337-1808"]
[null,null,"51-1344-1407"]
[null,null,"51-1346-0906"]
[null,null,"51-1346-1507"]
[null,null,"51-1348-0804"]
[null,null,"51-1348-0805"]
[null,null,"51-1353-0103"]
[null,null,"51-1359-1407"]
[null,null,"51-1362-0805"]
[null,null,"51-1368-1507"]
[null,null,"51-1368-1508"]
[null,null,"51-1369-1808"]
[null,null,"51-1383-0905"]
[null,null,"51-1395-0905"]
[null,null,"51-1396-0856"]
[null,null,"51-1397-0817"]
[null,null,"51-1397-0882"]
[null,null,"51-1403-1456"]
[null,null,"51-1403-1469"]
[null,null,"51-1403-1530"]
[null,null,"51-1403-1642"]
[null,null,"51-1403-1815"]
[null,null,"51-1403-1930"]
[null,null,"51-1404-1671"]
[null,null,"51-1404-1715"]
[null,null,"51-1404-1737"]
[null,null,"51-1404-1909"]
[null,null,"51-1404-1923"]
[null,null,"51-1404-1938"]
[null,null,"51-1404-2019"]
[null,null,"51-1427-0405"]
[null,null,"51-1430-1408"]
[null,null,"51-1436-0906"]
[null,null,"51-1442-0605"]
[null,null,"51-1471-1908"]
[null,null,"51-1488-0905"]
[null,null,"51-1488-2310"]
[null,null,"51-1488-2311"]
[null,null,"51-1496-1607"]
[null,null,"51-1497-1607"]
[null,null,"51-1498-1807"]
[null,null,"51-1504-1908"]
[null,null,"51-1526-1508"]
[null,null,"51-1539-0404"]
[null,null,"51-1539-0405"]
[null,null,"51-1546-2209"]
[null,null,"51-1547-2209"]
[null,null,"51-1556-1408"]
[null,null,"51-1556-1409"]
[null,null,"51-1579-2109"]
[null,null,"51-1588-0222"]
[null,null,"51-1588-0474"]
[null,null,"51-1588-0475"]
[null,null,"51-1589-0141"]
[null,null,"51-1604-1359"]
[null,null,"51-1604-2080"]
[null,null,"51-1604-2196"]
[null,null,"51-1627-0201"]
[null,null,"51-1641-0103"]
[null,null,"51-1677-0102"]
[null,null,"51-1677-1911"]
[null,null,"51-1677-1912"]
[null,null,"51-1700-1112"]
[null,null,"51-1705-1651"]
[null,null,"51-1705-1675"]
[null,null,"51-1705-1703"]
[null,null,"51-1705-1708"]
[null,null,"51-1705-1734"]
[null,null,"51-1705-1746"]
[null,null,"51-1705-1776"]
[null,null,"51-1705-1777"]
[null,null,"51-1705-1805"]
[null,null,"51-1705-1886"]
[null,null,"51-1705-1887"]
[null,null,"51-1706-1810"]
[null,null,"51-1707-1507"]
[null,null,"51-1707-1521"]
[null,null,"51-1707-1543"]
[null,null,"51-1708-1509"]
[null,null,"51-1736-1509"]
[null,null,"51-1760-0700"]
[null,null,"51-1770-2312"]
[null,null,"51-1779-2213"]
[null,null,"51-1796-0640"]
[null,null,"51-1801-2113"]
[null,null,"51-1803-0180"]
[null,null,"51-1805-0732"]
[null,null,"51-1817-0180"]
[null,null,"51-1817-0181"]
[null,null,"51-1850-0084"]
[null,null,"51-1856-0586"]
[null,null,"51-1885-1411"]
[null,null,"51-1890-2312"]
[null,null,"51-1890-2313"]
[null,null,"51-1891-0546"]
[null,null,"51-1903-0695"]
[null,null,"51-1905-1743"]
[null,null,"51-1905-1921"]
[null,null,"51-1906-2408"]
[null,null,"51-1917-1105"]
[null,null,"51-1917-1106"]
[null,null,"51-1921-2212"]
[null,null,"51-1921-2213"]
[null,null,"51-1921-2214"]
[null,null,"51-1921-2215"]
[null,null,"51-1925-1612"]
[null,null,"51-1926-1612"]
[null,null,"51-1926-1613"]
[null,null,"51-1933-1813"]
[null,null,"51-1947-2212"]
[null,null,"51-1955-1512"]
[null,null,"51-1955-1513"]
[null,null,"51-1956-1512"]
[null,null,"51-1968-0590"]
[null,null,"51-1970-0187"]
[null,null,"51-1985-1912"]
[null,null,"51-1989-2112"]
[null,null,"51-1989-2113"]
[null,null,"51-1989-2114"]
[null,null,"51-1989-2115"]
[null,null,"51-1990-2112"]
[null,null,"51-1991-1412"]
[null,null,"51-2004-1863"]
[null,null,"51-2005-2295"]
[null,null,"51-2051-2312"]
[null,null,"51-2085-0145"]
[null,null,"51-2091-0526"]
[null,null,"51-2093-0705"]
[null,null,"51-2100-0674"]
[null,null,"51-2103-0993"]
[null,null,"51-2163-0591"]
[null,null,"51-2169-1743"]
[null,null,"51-2172-2199"]
[null,null,"52-10082-4567"]
[null,null,"52-8627-3092"]
[null,null,"52-8980-3354"]
[null,null,"52-9269-5542"]
[null,null,"52-9275-5560"]
[null,null,"52-9275-5561"]
[null,null,"52-9977-4568"]
[null,null,"52-9977-4569"]
[null,null,"53-0072-0572"]
[null,null,"53-0089-0564"]
[null,null,"53-0144-1946"]
[null,null,"53-0145-1946"]
[null,null,"53-0145-1947"]
[null,null,"53-0145-1948"]
[null,null,"53-0145-1949"]
[null,null,"53-0145-1950"]
[null,null,"53-0148-1945"]
[null,null,"53-0310-1961"]
[null,null,"53-0369-0550"]
[null,null,"53-0471-1111"]
[null,null,"53-0471-1112"]
[null,null,"53-0728-2802"]
[null,null,"53-0816-3362"]
[null,null,"53-0816-3363"]
[null,null,"53-0928-2919"]
[null,null,"53-0928-2920"]
[null,null,"53-0928-2921"]
[null,null,"53-0932-3362"]
[null,null,"53-0933-3362"]
[null,null,"53-1127-2874"]
[null,null,"53-1127-2875"]
[null,null,"53-1269-1452"]
[null,null,"53-1271-1028"]
[null,null,"53-1323-2784"]
[null,null,"53-1323-2785"]
[null,null,"53-1352-1563"]
[null,null,"53-1353-1563"]
[null,null,"53-1440-1763"]
[null,null,"53-1490-1881"]
[null,null,"53-1492-1894"]
[null,null,"53-1493-1894"]
[null,null,"53-1509-0367"]
[null,null,"53-1509-0368"]
[null,null,"53-1524-1469"]
[null,null,"53-1563-4259"]
[null,null,"53-1593-2963"]
[null,null,"53-1617-1069"]
[null,null,"53-1621-4261"]
[null,null,"53-1622-4261"]
[null,null,"53-1674-2168"]
[null,null,"53-1675-2168"]
[null,null,"53-1723-2880"]
[null,null,"53-1723-2881"]
[null,null,"53-1829-0367"]
[null,null,"53-1830-0367"]
[null,null,"53-1953-2975"]
[null,null,"53-1953-2976"]
[null,null,"53-2022-2834"]
[null,null,"53-2022-2835"]
[null,null,"53-2065-4260"]
[null,null,"53-2065-4261"]
[null,null,"53-2258-2964"]
[null,null,"53-2258-2965"]
[null,null,"53-2258-2966"]
[null,null,"53-2322-3139"]
[null,null,"53-2323-3227"]
[null,null,"53-2323-3228"]
[null,null,"53-2524-3593"]
[null,null,"53-2524-3594"]
[null,null,"53-2524-3595"]
[null,null,"53-2563-1757"]
[null,null,"53-2563-1758"]
[null,null,"53-2567-1345"]
[null,null,"53-2567-1346"]
[null,null,"53-2719-2791"]
[null,null,"53-2887-2005"]
[null,null,"53-2888-2005"]
[null,null,"53-2888-2006"]
[null,null,"53-3033-0002"]
[null,null,"53-3064-1341"]
[null,null,"53-3249-0571"]
[null,null,"53-3250-0571"]
[null,null,"53-3384-2665"]
[null,null,"53-3385-2665"]
[null,null,"53-3660-2566"]
[null,null,"53-3731-0672"]
[null,null,"53-3782-4849"]
[null,null,"53-3783-4851"]
[null,null,"53-3854-1129"]
[null,null,"53-3855-1130"]
[null,null,"53-3874-4560"]
[null,null,"53-3972-4661"]
[null,null,"53-4054-0420"]
[null,null,"53-4054-0438"]
[null,null,"53-4054-0439"]
[null,null,"53-4054-0440"]
[null,null,"53-4133-5030"]
[null,null,"53-4133-5031"]
[null,null,"53-4133-5032"]
[null,null,"53-4133-5033"]
[null,null,"53-4234-0672"]
[null,null,"53-4525-0674"]
[null,null,"53-4527-0674"]
[null,null,"53-4528-0674"]
[null,null,"55-0102-0815"]
[null,null,"55-0102-1037"]
[null,null,"55-0102-1201"]
[null,null,"55-0191-1408"]
[null,null,"55-0210-4210"]
[null,null,"55-0305-1488"]
[null,null,"55-0390-1605"]
[null,null,"55-0403-1123"]
[null,null,"55-0403-1124"]
[null,null,"55-0403-1125"]
[null,null,"55-0405-1674"]
[null,null,"55-0406-1577"]
[null,null,"55-0472-1605"]
[null,null,"55-0476-1407"]
[null,null,"55-0501-0392"]
[null,null,"55-0501-0393"]
[null,null,"55-0505-1289"]
[null,null,"55-0505-1290"]
[null,null,"55-0505-1314"]
[null,null,"55-0505-1433"]
[null,null,"55-0571-1106"]
[null,null,"55-0607-2037"]
[null,null,"55-0703-1270"]
[null,null,"55-0704-1704"]
[null,null,"55-0798-0927"]
[null,null,"55-0798-0928"]
[null,null,"55-0798-0943"]
[null,null,"55-0804-1405"]
[null,null,"55-0805-1405"]
[null,null,"55-0805-1407"]
[null,null,"55-0809-4412"]
[null,null,"55-0809-4413"]
[null,null,"55-0904-1432"]
[null,null,"55-0904-1434"]
[null,null,"55-0905-1432"]
[null,null,"55-0906-2440"]
[null,null,"55-0906-2461"]
[null,null,"55-0906-2504"]
[null,null,"55-1006-4118"]
[null,null,"55-1105-2564"]
[null,null,"55-1106-2452"]
[null,null,"55-1106-2453"]
[null,null,"55-1107-3095"]
[null,null,"55-1107-3320"]
[null,null,"55-1108-3569"]
[null,null,"55-1113-3606"]
[null,null,"55-1207-3043"]
[null,null,"55-1208-3698"]
[null,null,"55-1247-3817"]
[null,null,"55-1258-3817"]
[null,null,"55-1294-3111"]
[null,null,"55-1295-0480"]
[null,null,"55-1393-0221"]
[null,null,"55-1424-3911"]
[null,null,"55-1431-3711"]
[null,null,"55-1432-3711"]
[null,null,"55-1445-3512"]
[null,null,"55-1450-3911"]
[null,null,"55-1451-3711"]
[null,null,"55-1478-3501"]
[null,null,"55-1480-0203"]
[null,null,"55-1492-0403"]
[null,null,"55-1502-2911"]
[null,null,"55-1502-2912"]
[null,null,"55-1524-3413"]
[null,null,"55-1578-3705"]
[null,null,"55-1578-3873"]
[null,null,"55-1578-3959"]
[null,null,"55-1578-3960"]
[null,null,"55-1578-3989"]
[null,null,"55-1579-4198"]
[null,null,"55-1593-1606"]
[null,null,"55-1593-1607"]
[null,null,"55-1606-0071"]
[null,null,"55-1606-0072"]
[null,null,"55-1606-0073"]
[null,null,"55-1606-0074"]
[null,null,"55-1622-1106"]
[null,null,"55-1674-1708"]
[null,null,"55-1693-3414"]
[null,null,"55-1693-3415"]
[null,null,"55-1706-0124"]
[null,null,"55-1728-4014"]
[null,null,"55-1769-4015"]
[null,null,"55-1807-1890"]
[null,null,"55-1809-0203"]
[null,null,"55-1871-3315"]
[null,null,"55-1873-2652"]
[null,null,"55-1875-4089"]
[null,null,"55-1900-2509"]
[null,null,"55-1901-2613"]
[null,null,"55-1911-0299"]
[null,null,"55-1961-4014"]
[null,null,"55-1962-4014"]
[null,null,"55-1970-3714"]
[null,null,"55-1971-3714"]
[null,null,"55-1971-3715"]
[null,null,"55-1974-4136"]
[null,null,"55-1974-4137"]
[null,null,"55-1975-3832"]
[null,null,"55-1975-3833"]
[null,null,"55-1975-4011"]
[null,null,"55-1978-4013"]
[null,null,"55-1978-4014"]
[null,null,"55-2032-4013"]
[null,null,"55-2032-4014"]
[null,null,"55-2121-3112"]
[null,null,"55-2174-3918"]
[null,null,"55-2174-3936"]
[null,null,"55-2174-4031"]
[null,null,"55-2174-4032"]
[null,null,"55-2373-4032"]
[null,null,"55-2373-4033"]
[null,null,"55-2436-0420"]
[null,null,"55-2482-4213"]
[null,null,"55-2489-4213"]
[null,null,"55-2490-4213"]
[null,null,"55-2497-0445"]
[null,null,"55-2584-0399"]
[null,null,"55-2596-0339"]
[null,null,"55-2596-0358"]
[null,null,"55-2596-0359"]
[null,null,"55-2701-0832"]
[null,null,"55-2858-0905"]
[null,null,"55-2969-3751"]
[null,null,"55-3066-3799"]
[null,null,"55-3066-3800"]
[null,null,"55-3066-3801"]
[null,null,"56-0018-1288"]
[null,null,"56-0018-1289"]
[null,null,"56-0019-1288"]
[null,null,"56-0019-1289"]
[null,null,"56-0089-0184"]
[null,null,"56-0089-0185"]
[null,null,"56-0090-0184"]
[null,null,"56-0103-1419"]
[null,null,"56-0103-1420"]
[null,null,"56-0103-1421"]
[null,null,"56-0103-2057"]
[null,null,"56-0132-1988"]
[null,null,"56-0203-1576"]
[null,null,"56-0203-1577"]
[null,null,"56-0294-1687"]
[null,null,"56-0294-1688"]
[null,null,"56-0294-1689"]
[null,null,"56-0321-1687"]
[null,null,"56-0321-1688"]
[null,null,"56-0323-1086"]
[null,null,"56-0332-0786"]
[null,null,"56-0332-0787"]
[null,null,"56-0332-1787"]
[null,null,"56-0332-1788"]
[null,null,"56-0332-1789"]
[null,null,"56-0332-1790"]
[null,null,"56-0333-0786"]
[null,null,"56-0402-1886"]
[null,null,"56-0402-1887"]
[null,null,"56-0403-0978"]
[null,null,"56-0403-0979"]
[null,null,"56-0436-1987"]
[null,null,"56-0436-1988"]
[null,null,"56-0436-1989"]
[null,null,"56-0440-1987"]
[null,null,"56-0440-1988"]
[null,null,"56-0464-1085"]
[null,null,"56-0464-1086"]
[null,null,"56-0584-0782"]
[null,null,"56-0585-0782"]
[null,null,"56-0601-2237"]
[null,null,"56-0602-2181"]
[null,null,"56-0602-2182"]
[null,null,"56-0602-2183"]
[null,null,"56-0631-0780"]
[null,null,"56-0693-0582"]
[null,null,"56-0697-0556"]
[null,null,"56-0697-0557"]
[null,null,"56-0697-0574"]
[null,null,"56-0697-0575"]
[null,null,"56-0698-2281"]
[null,null,"56-0698-2282"]
[null,null,"56-0698-2283"]
[null,null,"56-0736-0682"]
[null,null,"56-0736-0683"]
[null,null,"56-0737-0682"]
[null,null,"56-0737-0683"]
[null,null,"56-0737-0684"]
[null,null,"56-0738-0682"]
[null,null,"56-0738-0683"]
[null,null,"56-0738-0684"]
[null,null,"56-0899-0114"]
[null,null,"56-1096-1309"]
[null,null,"56-1267-1787"]
[null,null,"56-1447-2389"]
[null,null,"56-1448-2389"]
[null,null,"56-1448-2390"]
[null,null,"56-1497-0057"]
[null,null,"56-1532-1491"]
[null,null,"56-1796-1217"]
[null,null,"56-1798-1608"]
[null,null,"56-1798-1609"]
[null,null,"56-1798-1610"]
[null,null,"56-1892-1891"]
[null,null,"56-1893-1891"]
[null,null,"56-1894-0990"]
[null,null,"56-1894-0991"]
[null,null,"56-1894-1880"]
[null,null,"56-1894-1881"]
[null,null,"56-1896-1491"]
[null,null,"56-1897-0690"]
[null,null,"56-1897-0691"]
[null,null,"56-1897-1491"]
[null,null,"56-1897-2122"]
[null,null,"56-1938-0991"]
[null,null,"56-1939-0991"]
[null,null,"56-1975-1493"]
[null,null,"56-1975-1494"]
[null,null,"56-1990-0951"]
[null,null,"56-1991-1145"]
[null,null,"56-1991-1146"]
[null,null,"56-1991-1147"]
[null,null,"56-1991-1148"]
[null,null,"56-2024-0992"]
[null,null,"56-2024-0993"]
[null,null,"56-2024-0994"]
[null,null,"56-2025-0992"]
[null,null,"56-2035-0089"]
[null,null,"56-2035-0090"]
[null,null,"56-2035-0091"]
[null,null,"56-2035-0092"]
[null,null,"56-2094-1779"]
[null,null,"56-2094-1780"]
[null,null,"56-2122-0490"]
[null,null,"56-2122-0491"]
[null,null,"56-2189-0328"]
[null,null,"56-2189-0930"]
[null,null,"56-2189-0931"]
[null,null,"56-2190-0930"]
[null,null,"56-2208-0291"]
[null,null,"56-2256-0592"]
[null,null,"56-2256-0593"]
[null,null,"56-2256-0594"]
[null,null,"56-2256-0595"]
[null,null,"56-2292-1460"]
[null,null,"56-2292-1461"]
[null,null,"56-2292-1462"]
[null,null,"58-0106-2297"]
[null,null,"58-0202-1593"]
[null,null,"58-0318-2194"]
[null,null,"58-0318-2195"]
[null,null,"58-0343-4112"]
[null,null,"58-0343-4113"]
[null,null,"58-0347-2093"]
[null,null,"58-0347-2094"]
[null,null,"58-0347-2095"]
[null,null,"58-0348-2093"]
[null,null,"58-0353-3613"]
[null,null,"58-0355-4113"]
[null,null,"58-0453-2823"]
[null,null,"58-0453-2824"]
[null,null,"58-0453-2825"]
[null,null,"58-0553-3562"]
[null,null,"58-0553-3563"]
[null,null,"58-0553-3564"]
[null,null,"58-0584-1636"]
[null,null,"58-0585-1636"]
[null,null,"58-0585-1637"]
[null,null,"58-0593-1640"]
[null,null,"58-0602-1601"]
[null,null,"58-0602-1688"]
[null,null,"58-0602-1689"]
[null,null,"58-0696-0786"]
[null,null,"58-0696-0987"]
[null,null,"58-0696-0988"]
[null,null,"58-0696-1088"]
[null,null,"58-0700-1988"]
[null,null,"58-0701-1988"]
[null,null,"58-0751-3393"]
[null,null,"58-0751-3394"]
[null,null,"58-0836-2720"]
[null,null,"58-0851-3317"]
[null,null,"58-0851-3318"]
[null,null,"58-0896-0990"]
[null,null,"58-0898-1451"]
[null,null,"58-0951-3317"]
[null,null,"58-1069-2195"]
[null,null,"58-1125-1193"]
[null,null,"58-1144-1394"]
[null,null,"58-1161-1094"]
[null,null,"58-1196-1396"]
[null,null,"58-1309-3720"]
[null,null,"58-1342-1599"]
[null,null,"58-1349-3731"]
[null,null,"58-1397-1641"]
[null,null,"58-1397-1642"]
[null,null,"58-1621-2306"]
[null,null,"58-1648-3622"]
[null,null,"58-1648-3623"]
[null,null,"58-1690-0014"]
[null,null,"58-1694-2308"]
[null,null,"58-1700-2238"]
[null,null,"58-1700-2239"]
[null,null,"58-1700-2240"]
[null,null,"58-1700-2293"]
[null,null,"58-1706-0014"]
[null,null,"58-1745-3319"]
[null,null,"58-1745-3320"]
[null,null,"58-1756-0014"]
[null,null,"58-1841-2822"]
[null,null,"58-1884-1106"]
[null,null,"58-1890-1509"]
[null,null,"58-1904-2312"]
[null,null,"58-1904-2313"]
[null,null,"58-1929-2011"]
[null,null,"58-1929-2012"]
[null,null,"58-1937-2924"]
[null,null,"58-1938-2952"]
[null,null,"58-1944-3922"]
[null,null,"58-1948-2212"]
[null,null,"58-1949-2212"]
[null,null,"58-1950-2522"]
[null,null,"58-1998-2012"]
[null,null,"58-2076-2522"]
[null,null,"58-2093-1062"]
[null,null,"58-2093-1063"]
[null,null,"58-2093-1064"]
[null,null,"58-2096-2622"]
[null,null,"58-2136-2883"]
[null,null,"58-2137-2977"]
[null,null,"58-2137-2978"]
[null,null,"58-2137-2979"]
[null,null,"58-2189-0506"]
[null,null,"58-2211-0808"]
[null,null,"58-2214-0808"]
[null,null,"58-2214-0809"]
[null,null,"58-2215-0809"]
[null,null,"58-2215-0810"]
[null,null,"58-2243-3775"]
[null,null,"58-2265-0708"]
[null,null,"58-2293-1312"]
[null,null,"58-2298-2013"]
[null,null,"58-2298-3623"]
[null,null,"58-2325-0206"]
[null,null,"58-2325-0207"]
[null,null,"58-2340-3423"]
[null,null,"58-2371-2623"]
[null,null,"58-2371-2624"]
[null,null,"58-2389-0659"]
[null,null,"58-2494-1769"]
[null,null,"58-2494-1770"]
[null,null,"58-2494-1771"]
[null,null,"58-2494-1772"]
[null,null,"58-2494-1773"]
[null,null,"58-2494-1774"]
[null,null,"58-2494-1795"]
[null,null,"58-2495-1794"]
[null,null,"58-2495-1795"]
[null,null,"58-2495-1796"]
[null,null,"58-2495-1797"]
[null,null,"58-2717-2924"]
[null,null,"58-2717-2925"]
[null,null,"58-2742-4124"]
[null,null,"58-2772-0816"]
[null,null,"58-2772-0817"]
[null,null,"58-2780-0716"]
[null,null,"58-2788-0793"]
[null,null,"58-2835-3263"]
[null,null,"58-2835-3264"]
[null,null,"58-2838-0817"]
[null,null,"58-2840-3963"]
[null,null,"58-2841-3963"]
[null,null,"58-2841-3964"]
[null,null,"58-2874-0416"]
[null,null,"58-2887-0418"]
[null,null,"58-2888-0418"]
[null,null,"58-2888-0419"]
[null,null,"58-2888-0420"]
[null,null,"58-2963-1622"]
[null,null,"58-2965-1721"]
[null,null,"58-3034-3226"]
[null,null,"58-3085-0441"]
[null,null,"58-3086-0524"]
[null,null,"58-3090-0938"]
[null,null,"58-3090-0939"]
[null,null,"58-3093-1852"]
[null,null,"58-3093-1853"]
[null,null,"58-3139-3823"]
[null,null,"58-3141-4159"]
[null,null,"58-3156-1824"]
[null,null,"58-3161-1824"]
[null,null,"58-3168-4127"]
[null,null,"58-3169-4127"]
[null,null,"58-3190-1048"]
[null,null,"58-3190-1049"]
[null,null,"58-3194-2012"]
[null,null,"58-3194-4027"]
[null,null,"58-3237-3561"]
[null,null,"58-3237-3562"]
[null,null,"58-3237-3563"]
[null,null,"58-3237-3564"]
[null,null,"58-3239-3928"]
[null,null,"58-3273-1825"]
[null,null,"58-3273-1826"]
[null,null,"58-3313-3226"]
[null,null,"58-3313-3227"]
[null,null,"58-3334-3289"]
[null,null,"58-3334-3290"]
[null,null,"58-3336-3491"]
[null,null,"58-3336-3492"]
[null,null,"58-3336-3493"]
[null,null,"58-3336-3494"]
[null,null,"58-3358-2227"]
[null,null,"58-3358-2228"]
[null,null,"58-3387-0643"]
[null,null,"58-3396-2239"]
[null,null,"58-3396-2240"]
[null,null,"58-3403-1024"]
[null,null,"58-3415-1826"]
[null,null,"58-3433-3132"]
[null,null,"58-3433-3169"]
[null,null,"58-3433-3314"]
[null,null,"58-3434-3315"]
[null,null,"58-3434-3370"]
[null,null,"58-3434-3379"]
[null,null,"58-3434-3387"]
[null,null,"58-3434-3388"]
[null,null,"58-3434-3389"]
[null,null,"58-3434-3402"]
[null,null,"58-3434-3403"]
[null,null,"58-3435-3426"]
[null,null,"58-3435-3428"]
[null,null,"58-3436-3520"]
[null,null,"58-3436-3533"]
[null,null,"58-3437-3624"]
[null,null,"58-3437-3694"]
[null,null,"58-3437-3695"]
[null,null,"58-3437-3727"]
[null,null,"58-3446-0423"]
[null,null,"58-3447-0423"]
[null,null,"58-3486-0470"]
[null,null,"58-3486-0471"]
[null,null,"58-3486-0621"]
[null,null,"58-3487-0622"]
[null,null,"58-3488-0870"]
[null,null,"58-3492-1843"]
[null,null,"58-3492-1844"]
[null,null,"58-3495-2185"]
[null,null,"58-3495-2186"]
[null,null,"58-3526-2463"]
[null,null,"58-3526-2464"]
[null,null,"58-3526-2470"]
[null,null,"58-3540-0424"]
[null,null,"58-3540-0425"]
[null,null,"58-3545-3829"]
[null,null,"58-3625-2474"]
[null,null,"62-0179-4126"]
[null,null,"62-0226-4959"]
[null,null,"62-0286-4826"]
[null,null,"62-0287-4826"]
[null,null,"62-0296-4926"]
[null,null,"62-0326-2934"]
[null,null,"62-0326-2935"]
[null,null,"62-0326-2936"]
[null,null,"62-0326-2937"]
[null,null,"62-0410-1741"]
[null,null,"62-0410-1742"]
[null,null,"62-0425-4520"]
[null,null,"62-0425-4529"]
[null,null,"62-0425-4530"]
[null,null,"62-0459-1841"]
[null,null,"62-0459-1842"]
[null,null,"62-0460-1841"]
[null,null,"62-0461-1841"]
[null,null,"62-0526-1929"]
[null,null,"62-0526-1930"]
[null,null,"62-0626-5246"]
[null,null,"62-0688-2426"]
[null,null,"62-0722-2763"]
[null,null,"62-0781-5125"]
[null,null,"62-0792-3626"]
[null,null,"62-1006-2649"]
[null,null,"62-1006-2650"]
[null,null,"62-1019-1933"]
[null,null,"62-1155-1342"]
[null,null,"62-1155-1343"]
[null,null,"62-1155-1344"]
[null,null,"62-1189-0641"]
[null,null,"62-1201-4227"]
[null,null,"62-1216-2955"]
[null,null,"62-1249-5228"]
[null,null,"62-1250-2127"]
[null,null,"62-1251-4527"]
[null,null,"62-1251-5231"]
[null,null,"62-1281-2127"]
[null,null,"62-1281-2128"]
[null,null,"62-1281-2129"]
[null,null,"62-1282-4627"]
[null,null,"62-1312-5127"]
[null,null,"62-1314-2827"]
[null,null,"62-1315-5127"]
[null,null,"62-1318-3423"]
[null,null,"62-1325-5060"]
[null,null,"62-1395-2527"]
[null,null,"62-1413-2423"]
[null,null,"62-1416-3085"]
[null,null,"62-1416-3086"]
[null,null,"62-1446-1078"]
[null,null,"62-1446-1079"]
[null,null,"62-1446-1080"]
[null,null,"62-1447-1078"]
[null,null,"62-1448-4827"]
[null,null,"62-1512-2262"]
[null,null,"62-1512-2263"]
[null,null,"62-1512-2264"]
[null,null,"62-1512-2265"]
[null,null,"62-1565-2026"]
[null,null,"62-1566-2026"]
[null,null,"62-1566-2027"]
[null,null,"62-1583-2027"]
[null,null,"62-1583-2028"]
[null,null,"62-1605-5228"]
[null,null,"62-1605-5229"]
[null,null,"62-1641-3127"]
[null,null,"62-1654-3027"]
[null,null,"62-1654-3028"]
[null,null,"62-1662-5128"]
[null,null,"62-1708-5028"]
[null,null,"62-1708-5029"]
[null,null,"62-1711-2112"]
[null,null,"62-1711-2113"]
[null,null,"62-1711-2114"]
[null,null,"62-1756-2527"]
[null,null,"62-1773-2527"]
[null,null,"62-1796-4628"]
[null,null,"62-1811-2568"]
[null,null,"62-1847-1466"]
[null,null,"62-1914-3378"]
[null,null,"62-1914-3392"]
[null,null,"62-1923-4825"]
[null,null,"62-1933-4828"]
[null,null,"62-1934-3427"]
[null,null,"62-1935-3427"]
[null,null,"62-1943-4629"]
[null,null,"62-1949-3327"]
[null,null,"62-2010-4328"]
[null,null,"62-2010-4329"]
[null,null,"62-2013-3074"]
[null,null,"62-2013-3112"]
[null,null,"62-2013-3113"]
[null,null,"62-2013-3155"]
[null,null,"62-2013-3193"]
[null,null,"62-2041-4328"]
[null,null,"62-2042-4328"]
[null,null,"62-2099-2428"]
[null,null,"62-2108-2224"]
[null,null,"62-2108-2225"]
[null,null,"62-2121-3327"]
[null,null,"62-2150-3327"]
[null,null,"62-2150-3328"]
[null,null,"62-2185-5054"]
[null,null,"62-2225-1442"]
[null,null,"62-2230-2828"]
[null,null,"62-2234-2428"]
[null,null,"62-2235-2427"]
[null,null,"62-2256-2095"]
[null,null,"62-2273-1743"]
[null,null,"62-2312-2964"]
[null,null,"62-2406-2605"]
[null,null,"62-2406-2606"]
[null,null,"62-2410-3218"]
[null,null,"62-2410-3219"]
[null,null,"62-2419-4317"]
[null,null,"62-2420-1342"]
[null,null,"62-2420-4317"]
[null,null,"62-2443-1131"]
[null,null,"62-2446-1650"]
[null,null,"62-2452-3229"]
[null,null,"62-2505-2551"]
[null,null,"62-2505-2552"]
[null,null,"62-2573-1442"]
[null,null,"62-2610-3291"]
[null,null,"62-2682-1643"]
[null,null,"62-2682-1644"]
[null,null,"62-2684-3329"]
[null,null,"62-2684-3330"]
[null,null,"62-2715-4001"]
[null,null,"62-2715-4002"]
[null,null,"62-2715-4003"]
[null,null,"62-2715-4004"]
[null,null,"62-2719-4563"]
[null,null,"62-2733-3529"]
[null,null,"62-2739-2830"]
[null,null,"62-2740-1442"]
[null,null,"62-2741-1442"]
[null,null,"62-2805-2759"]
[null,null,"62-2805-2761"]
[null,null,"62-2892-2931"]
[null,null,"62-2899-3230"]
[null,null,"62-2907-3101"]
[null,null,"62-2907-3102"]
[null,null,"62-2912-3758"]
[null,null,"62-2913-3758"]
[null,null,"62-2966-2831"]
[null,null,"62-3008-3246"]
[null,null,"62-3032-3979"]
[null,null,"62-3058-1931"]
[null,null,"62-3110-3031"]
[null,null,"62-3111-3031"]
[null,null,"62-3111-3733"]
[null,null,"62-3112-3855"]
[null,null,"62-3112-3955"]
[null,null,"62-3120-4946"]
[null,null,"62-3139-3030"]
[null,null,"62-3140-3030"]
[null,null,"62-3145-2331"]
[null,null,"62-3146-2331"]
[null,null,"62-3146-2332"]
[null,null,"62-3164-4829"]
[null,null,"62-3164-4830"]
[null,null,"62-3201-5138"]
[null,null,"62-3202-5138"]
[null,null,"62-3203-3430"]
[null,null,"62-3203-3431"]
[null,null,"62-3203-3432"]
[null,null,"62-3240-2831"]
[null,null,"62-3254-4129"]
[null,null,"62-3272-2131"]
[null,null,"62-3278-3829"]
[null,null,"62-3287-3529"]
[null,null,"62-3310-3764"]
[null,null,"62-3326-2131"]
[null,null,"62-3363-3031"]
[null,null,"62-3420-5020"]
[null,null,"62-3420-5028"]
[null,null,"62-3420-5136"]
[null,null,"62-3420-5137"]
[null,null,"62-3490-2831"]
[null,null,"62-3490-2832"]
[null,null,"62-3491-2831"]
[null,null,"63-0005-0361"]
[null,null,"63-0010-1680"]
[null,null,"63-0010-1760"]
[null,null,"63-0010-1794"]
[null,null,"63-0010-1848"]
[null,null,"63-0011-2183"]
[null,null,"63-0011-2185"]
[null,null,"63-0026-1285"]
[null,null,"63-0030-2184"]
[null,null,"63-0058-0286"]
[null,null,"63-0068-0386"]
[null,null,"63-0081-1884"]
[null,null,"63-0095-2184"]
[null,null,"63-0098-1485"]
[null,null,"63-0104-0586"]
[null,null,"63-0110-0586"]
[null,null,"63-0111-0861"]
[null,null,"63-0117-0187"]
[null,null,"63-0118-2094"]
[null,null,"63-0118-2103"]
[null,null,"63-0119-2159"]
[null,null,"63-0119-2184"]
[null,null,"63-0122-0786"]
[null,null,"63-0126-1984"]
[null,null,"63-0172-1486"]
[null,null,"63-0195-1585"]
[null,null,"63-0196-1386"]
[null,null,"63-0198-1486"]
[null,null,"63-0207-2184"]
[null,null,"63-0208-1984"]
[null,null,"63-0209-1585"]
[null,null,"63-0214-1319"]
[null,null,"63-0214-1332"]
[null,null,"63-0215-1419"]
[null,null,"63-0215-1781"]
[null,null,"63-0217-1989"]
[null,null,"63-0218-2090"]
[null,null,"63-0218-2172"]
[null,null,"63-0220-2277"]
[null,null,"63-0221-1983"]
[null,null,"63-0250-1386"]
[null,null,"63-0266-1386"]
[null,null,"63-0273-1573"]
[null,null,"63-0294-1684"]
[null,null,"63-0301-2183"]
[null,null,"63-0310-0885"]
[null,null,"63-0314-0586"]
[null,null,"63-0321-1684"]
[null,null,"63-0339-0585"]
[null,null,"63-0348-1385"]
[null,null,"63-0358-1285"]
[null,null,"63-0391-1385"]
[null,null,"63-0397-0002"]
[null,null,"63-0408-0095"]
[null,null,"63-0408-0193"]
[null,null,"63-0410-0667"]
[null,null,"63-0410-0717"]
[null,null,"63-0410-0739"]
[null,null,"63-0410-1128"]
[null,null,"63-0413-1435"]
[null,null,"63-0414-1485"]
[null,null,"63-0414-1486"]
[null,null,"63-0415-1767"]
[null,null,"63-0417-0385"]
[null,null,"63-0443-0185"]
[null,null,"63-0444-1384"]
[null,null,"63-0473-1284"]
[null,null,"63-0499-1383"]
[null,null,"63-0507-0004"]
[null,null,"63-0507-0246"]
[null,null,"63-0514-1546"]
[null,null,"63-0514-1596"]
[null,null,"63-0514-1702"]
[null,null,"63-0514-1718"]
[null,null,"63-0515-1797"]
[null,null,"63-0515-1861"]
[null,null,"63-0516-1848"]
[null,null,"63-0528-0185"]
[null,null,"63-0530-1983"]
[null,null,"63-0560-1684"]
[null,null,"63-0568-0284"]
[null,null,"63-0569-0284"]
[null,null,"63-0573-2184"]
[null,null,"63-0601-0284"]
[null,null,"63-0606-1883"]
[null,null,"63-0607-0196"]
[null,null,"63-0607-0280"]
[null,null,"63-0607-0545"]
[null,null,"63-0612-1543"]
[null,null,"63-0613-1657"]
[null,null,"63-0614-1742"]
[null,null,"63-0614-1743"]
[null,null,"63-0616-1899"]
[null,null,"63-0617-2062"]
[null,null,"63-0617-2201"]
[null,null,"63-0624-0384"]
[null,null,"63-0640-0183"]
[null,null,"63-0643-1885"]
[null,null,"63-0664-1384"]
[null,null,"63-0669-1384"]
[null,null,"63-0672-0183"]
[null,null,"63-0677-0282"]
[null,null,"63-0677-2182"]
[null,null,"63-0680-0383"]
[null,null,"63-0688-1289"]
[null,null,"63-0704-1995"]
[null,null,"63-0708-1929"]
[null,null,"63-0713-1290"]
[null,null,"63-0725-1974"]
[null,null,"63-0725-2181"]
[null,null,"63-0734-0583"]
[null,null,"63-0746-2182"]
[null,null,"63-0778-1885"]
[null,null,"63-0789-0381"]
[null,null,"63-0791-1977"]
[null,null,"63-0799-2183"]
[null,null,"63-0802-0083"]
[null,null,"63-0803-0087"]
[null,null,"63-0803-0136"]
[null,null,"63-0805-0398"]
[null,null,"63-0805-0420"]
[null,null,"63-0807-0553"]
[null,null,"63-0823-1083"]
[null,null,"63-0826-1978"]
[null,null,"63-0856-1979"]
[null,null,"63-0864-1083"]
[null,null,"63-0871-1978"]
[null,null,"63-0886-1288"]
[null,null,"63-0904-0588"]
[null,null,"63-0906-0002"]
[null,null,"63-0906-0467"]
[null,null,"63-0906-1418"]
[null,null,"63-0906-1942"]
[null,null,"63-0907-1064"]
[null,null,"63-0908-0920"]
[null,null,"63-0910-0583"]
[null,null,"63-0915-1979"]
[null,null,"63-0923-0382"]
[null,null,"63-0931-0482"]
[null,null,"63-0962-0381"]
[null,null,"63-0976-0983"]
[null,null,"63-0980-0594"]
[null,null,"63-0982-0481"]
[null,null,"63-0986-1383"]
[null,null,"63-1001-0044"]
[null,null,"63-1004-0474"]
[null,null,"63-1004-1852"]
[null,null,"63-1008-1452"]
[null,null,"63-1015-1382"]
[null,null,"63-1036-0583"]
[null,null,"63-1044-0982"]
[null,null,"63-1053-1382"]
[null,null,"63-1063-1880"]
[null,null,"63-1097-2181"]
[null,null,"63-1106-1035"]
[null,null,"63-1106-1512"]
[null,null,"63-1106-1581"]
[null,null,"63-1106-1595"]
[null,null,"63-1107-1765"]
[null,null,"63-1109-1881"]
[null,null,"63-1110-1879"]
[null,null,"63-1111-2060"]
[null,null,"63-1112-2099"]
[null,null,"63-1113-2169"]
[null,null,"63-1114-2275"]
[null,null,"63-1120-0081"]
[null,null,"63-1142-0582"]
[null,null,"63-1187-2181"]
[null,null,"63-1200-0025"]
[null,null,"63-1200-0095"]
[null,null,"63-1200-1381"]
[null,null,"63-1208-1389"]
[null,null,"63-1208-1516"]
[null,null,"63-1208-1671"]
[null,null,"63-1209-1718"]
[null,null,"63-1228-2780"]
[null,null,"63-1238-2581"]
[null,null,"63-1255-1580"]
[null,null,"63-1284-0180"]
[null,null,"63-1301-1879"]
[null,null,"63-1303-1122"]
[null,null,"63-1304-1212"]
[null,null,"63-1306-1479"]
[null,null,"63-1308-1682"]
[null,null,"63-1312-1896"]
[null,null,"63-1312-1980"]
[null,null,"63-1313-1829"]
[null,null,"63-1313-2266"]
[null,null,"63-1313-2544"]
[null,null,"63-1313-2629"]
[null,null,"63-1314-2707"]
[null,null,"63-1324-1980"]
[null,null,"63-1338-1580"]
[null,null,"63-1341-0080"]
[null,null,"63-1341-2180"]
[null,null,"63-1351-0080"]
[null,null,"63-1359-0480"]
[null,null,"63-1363-1679"]
[null,null,"63-1404-1278"]
[null,null,"63-1412-2366"]
[null,null,"63-1413-2135"]
[null,null,"63-1413-2263"]
[null,null,"63-1413-2678"]
[null,null,"63-1414-2659"]
[null,null,"63-1414-2846"]
[null,null,"63-1415-2819"]
[null,null,"63-1422-2580"]
[null,null,"63-1483-0078"]
[null,null,"63-1492-1277"]
[null,null,"63-1499-0159"]
[null,null,"63-1503-0905"]
[null,null,"63-1504-1177"]
[null,null,"63-1504-1278"]
[null,null,"63-1505-1278"]
[null,null,"63-1511-2083"]
[null,null,"63-1512-2123"]
[null,null,"63-1513-2356"]
[null,null,"63-1567-2674"]
[null,null,"63-1592-0277"]
[null,null,"63-1600-0309"]
[null,null,"63-1609-1078"]
[null,null,"63-1687-2378"]
[null,null,"63-1689-1877"]
[null,null,"63-1697-1277"]
[null,null,"63-1699-0276"]
[null,null,"63-1703-1295"]
[null,null,"63-1706-1609"]
[null,null,"63-1710-0756"]
[null,null,"63-1711-2205"]
[null,null,"63-1711-2447"]
[null,null,"63-1711-2488"]
[null,null,"63-1711-2760"]
[null,null,"63-1713-0577"]
[null,null,"63-1732-0577"]
[null,null,"63-1761-2779"]
[null,null,"63-1811-0576"]
[null,null,"63-1812-2555"]
[null,null,"63-1812-2689"]
[null,null,"63-1827-0276"]
[null,null,"63-1827-2578"]
[null,null,"63-1828-2177"]
[null,null,"63-1859-0175"]
[null,null,"63-1863-2377"]
[null,null,"63-1893-0775"]
[null,null,"63-1895-0612"]
[null,null,"63-1896-1283"]
[null,null,"63-1897-0783"]
[null,null,"63-1907-1981"]
[null,null,"63-1907-2007"]
[null,null,"63-1918-0174"]
[null,null,"63-1929-2377"]
[null,null,"63-1953-0001"]
[null,null,"63-1953-0002"]
[null,null,"63-1954-0001"]
[null,null,"63-1974-0975"]
[null,null,"63-1975-2479"]
[null,null,"63-1993-0297"]
[null,null,"63-1993-0340"]
[null,null,"63-1993-2174"]
[null,null,"63-1994-0273"]
[null,null,"63-1995-0913"]
[null,null,"63-1997-1065"]
[null,null,"63-1997-1275"]
[null,null,"63-1999-1461"]
[null,null,"63-2000-2378"]
[null,null,"63-2001-1797"]
[null,null,"63-2006-1804"]
[null,null,"63-2009-2277"]
[null,null,"63-2009-2285"]
[null,null,"63-2016-2466"]
[null,null,"63-2065-2377"]
[null,null,"63-2067-0773"]
[null,null,"63-2072-0473"]
[null,null,"63-2082-0473"]
[null,null,"63-2095-1777"]
[null,null,"63-2099-1470"]
[null,null,"63-2103-1575"]
[null,null,"63-2118-2784"]
[null,null,"63-2131-1867"]
[null,null,"63-2135-1867"]
[null,null,"63-2138-1369"]
[null,null,"63-2145-0873"]
[null,null,"63-2187-1867"]
[null,null,"63-2194-0597"]
[null,null,"63-2198-1776"]
[null,null,"63-2206-2173"]
[null,null,"63-2212-1937"]
[null,null,"63-2214-2224"]
[null,null,"63-2238-0571"]
[null,null,"63-2242-1072"]
[null,null,"63-2275-1572"]
[null,null,"63-2281-1367"]
[null,null,"63-2291-0210"]
[null,null,"63-2293-0499"]
[null,null,"63-2295-0692"]
[null,null,"63-2306-0470"]
[null,null,"63-2308-2570"]
[null,null,"63-2309-1776"]
[null,null,"63-2309-2744"]
[null,null,"63-2323-1877"]
[null,null,"63-2329-2375"]
[null,null,"63-2343-1470"]
[null,null,"63-2350-2375"]
[null,null,"63-2356-0269"]
[null,null,"63-2358-0269"]
[null,null,"63-2389-0025"]
[null,null,"63-2399-1372"]
[null,null,"63-2401-1798"]
[null,null,"63-2403-1972"]
[null,null,"63-2403-1973"]
[null,null,"63-2406-2306"]
[null,null,"64-0001-2211"]
[null,null,"64-0004-0024"]
[null,null,"64-0004-0098"]
[null,null,"64-0005-0731"]
[null,null,"64-0025-0102"]
[null,null,"64-0072-2106"]
[null,null,"64-0103-2157"]
[null,null,"64-0121-1804"]
[null,null,"64-0121-2007"]
[null,null,"64-0139-1906"]
[null,null,"64-0203-2094"]
[null,null,"64-0204-0363"]
[null,null,"64-0204-0510"]
[null,null,"64-0204-1053"]
[null,null,"64-0204-1085"]
[null,null,"64-0204-1315"]
[null,null,"64-0205-1122"]
[null,null,"64-0210-1007"]
[null,null,"64-0218-1328"]
[null,null,"64-0252-0701"]
[null,null,"64-0288-1202"]
[null,null,"64-0297-1202"]
[null,null,"64-0302-2537"]
[null,null,"64-0303-1469"]
[null,null,"64-0303-1552"]
[null,null,"64-0305-0814"]
[null,null,"64-0306-0836"]
[null,null,"64-0384-1202"]
[null,null,"64-0403-1906"]
[null,null,"64-0404-1023"]
[null,null,"64-0406-1176"]
[null,null,"64-0437-0700"]
[null,null,"64-0453-1201"]
[null,null,"64-0503-2260"]
[null,null,"64-0514-0700"]
[null,null,"64-0519-1403"]
[null,null,"64-0545-1504"]
[null,null,"64-0552-0401"]
[null,null,"64-0574-2305"]
[null,null,"64-0587-1101"]
[null,null,"64-0601-0101"]
[null,null,"64-0602-2010"]
[null,null,"64-0603-0727"]
[null,null,"64-0603-0728"]
[null,null,"64-0603-1201"]
[null,null,"64-0603-1502"]
[null,null,"64-0603-1682"]
[null,null,"64-0604-0639"]
[null,null,"64-0604-0770"]
[null,null,"64-0604-1091"]
[null,null,"64-0605-1265"]
[null,null,"64-0633-0401"]
[null,null,"64-0646-0101"]
[null,null,"64-0678-0201"]
[null,null,"64-0684-1407"]
[null,null,"64-0697-1106"]
[null,null,"64-0702-0507"]
[null,null,"64-0706-0806"]
[null,null,"64-0706-0808"]
[null,null,"64-0745-1107"]
[null,null,"64-0801-0090"]
[null,null,"64-0801-0144"]
[null,null,"64-0802-0433"]
[null,null,"64-0809-0980"]
[null,null,"64-0814-1461"]
[null,null,"64-0863-1108"]
[null,null,"64-0880-1708"]
[null,null,"64-0882-0707"]
[null,null,"64-0888-0602"]
[null,null,"64-0914-1662"]
[null,null,"64-0985-0301"]
[null,null,"64-1000-0131"]
[null,null,"64-1003-0101"]
[null,null,"64-1011-1207"]
[null,null,"64-1017-2755"]
[null,null,"64-1059-0101"]
[null,null,"64-1079-0601"]
[null,null,"64-1116-2901"]
[null,null,"64-1180-0403"]
[null,null,"64-1182-0101"]
[null,null,"64-1193-3108"]
[null,null,"64-1200-0160"]
[null,null,"64-1200-0219"]
[null,null,"64-1201-0399"]
[null,null,"64-1201-0498"]
[null,null,"64-1205-0807"]
[null,null,"64-1207-0889"]
[null,null,"64-1207-0899"]
[null,null,"64-1210-1122"]
[null,null,"64-1210-1135"]
[null,null,"64-1210-1205"]
[null,null,"64-1213-1394"]
[null,null,"64-1217-3002"]
[null,null,"64-1217-3107"]
[null,null,"64-1219-3208"]
[null,null,"64-1221-3535"]
[null,null,"64-1223-0101"]
[null,null,"64-1245-3208"]
[null,null,"64-1263-3209"]
[null,null,"64-1275-0214"]
[null,null,"64-1275-0218"]
[null,null,"64-1275-0261"]
[null,null,"64-1294-3210"]
[null,null,"64-1299-0009"]
[null,null,"64-1299-0041"]
[null,null,"64-1300-0073"]
[null,null,"64-1301-0726"]
[null,null,"64-1301-0804"]
[null,null,"64-1301-0836"]
[null,null,"64-1320-3112"]
[null,null,"64-1321-3005"]
[null,null,"64-1324-0352"]
[null,null,"64-1343-0352"]
[null,null,"64-1356-0402"]
[null,null,"64-1399-0015"]
[null,null,"64-1427-0563"]
[null,null,"64-1521-3413"]
[null,null,"68-0621-0362"]
[null,null,"68-0628-0372"]
[null,null,"68-0640-0387"]
[null,null,"68-0640-0388"]
[null,null,"68-0682-0109"]
[null,null,"68-0689-0455"]
[null,null,"68-0690-0455"]
[null,null,"68-0714-0107"]
[null,null,"68-0814-1690"]
[null,null,"68-0826-0407"]
[null,null,"68-0937-0409"]
[null,null,"68-0992-0406"]
[null,null,"68-1001-0380"]
[null,null,"68-1001-0388"]
[null,null,"68-1013-1307"]
[null,null,"68-1013-1308"]
[null,null,"68-1013-1440"]
[null,null,"68-1013-1516"]
[null,null,"68-1013-1517"]
[null,null,"68-1014-1570"]
[null,null,"68-1014-1571"]
[null,null,"68-1014-1572"]
[null,null,"68-1039-0005"]
[null,null,"68-1097-0105"]
[null,null,"68-1112-1297"]
[null,null,"68-1112-1298"]
[null,null,"68-1112-1299"]
[null,null,"68-1112-1300"]
[null,null,"68-1112-1463"]
[null,null,"68-1113-1394"]
[null,null,"68-1113-1413"]
[null,null,"68-1113-1598"]
[null,null,"68-1160-0204"]
[null,null,"68-1160-0205"]
[null,null,"68-1161-0204"]
[null,null,"68-1219-0903"]
[null,null,"68-1245-1504"]
[null,null,"68-1272-1304"]
[null,null,"68-1272-1305"]
[null,null,"68-1286-0404"]
[null,null,"68-1286-0405"]
[null,null,"68-1304-0777"]
[null,null,"68-1309-0030"]
[null,null,"68-1309-0031"]
[null,null,"68-1309-0032"]
[null,null,"68-1309-0038"]
[null,null,"68-1309-0039"]
[null,null,"68-1312-0506"]
[null,null,"68-1320-1192"]
[null,null,"68-1328-1096"]
[null,null,"68-1355-1704"]
[null,null,"68-1355-1705"]
[null,null,"68-1376-0105"]
[null,null,"68-1376-0106"]
[null,null,"68-1377-0105"]
[null,null,"68-1382-0707"]
[null,null,"68-1389-0707"]
[null,null,"68-1411-0624"]
[null,null,"68-1411-1226"]
[null,null,"68-1418-1281"]
[null,null,"68-1425-1289"]
[null,null,"68-1431-0707"]
[null,null,"68-1432-0707"]
[null,null,"68-1448-1324"]
[null,null,"68-1479-1390"]
[null,null,"68-1507-0699"]
[null,null,"68-1508-0825"]
[null,null,"68-1526-0105"]
[null,null,"68-1538-0505"]
[null,null,"68-1538-0506"]
[null,null,"68-1538-0507"]
[null,null,"68-1555-0205"]
[null,null,"68-1556-0205"]
[null,null,"68-1556-0206"]
[null,null,"68-1572-1003"]
[null,null,"68-1634-0404"]
[null,null,"68-1635-0504"]
[null,null,"68-1635-0505"]
[null,null,"68-1635-0506"]
[null,null,"68-1636-0504"]
[null,null,"68-1657-1703"]
[null,null,"68-1676-1303"]
[null,null,"68-1679-0700"]
[null,null,"68-1681-0504"]
[null,null,"68-1684-1502"]
[null,null,"68-1686-0506"]
[null,null,"68-1686-0551"]
[null,null,"68-1688-0699"]
[null,null,"68-1710-0752"]
[null,null,"68-1710-0753"]
[null,null,"68-1714-1569"]
[null,null,"68-1715-1779"]
[null,null,"68-1715-1780"]
[null,null,"68-1715-1781"]
[null,null,"68-1738-1703"]
[null,null,"68-1740-1703"]
[null,null,"68-1758-0802"]
[null,null,"68-1788-1303"]
[null,null,"68-1789-1302"]
[null,null,"68-1811-0702"]
[null,null,"68-1824-0702"]
[null,null,"68-1840-1503"]
[null,null,"68-1840-1504"]
[null,null,"68-1905-0019"]
[null,null,"68-1906-0703"]
[null,null,"68-1907-0271"]
[null,null,"68-1910-1020"]
[null,null,"68-1910-1021"]
[null,null,"68-1910-1402"]
[null,null,"68-1910-1403"]
[null,null,"68-1910-1404"]
[null,null,"68-1910-1405"]
[null,null,"68-1911-1243"]
[null,null,"68-1911-1399"]
[null,null,"68-1911-1400"]
[null,null,"68-1911-1401"]
[null,null,"68-1911-1402"]
[null,null,"68-1911-1696"]
[null,null,"68-1979-1301"]
[null,null,"68-1981-1893"]
[null,null,"68-1981-1894"]
[null,null,"68-1987-0702"]
[null,null,"68-2011-1301"]
[null,null,"68-2012-2010"]
[null,null,"68-2016-2094"]
[null,null,"68-2051-0201"]
[null,null,"68-2084-1301"]
[null,null,"68-2084-1302"]
[null,null,"68-2090-1894"]
[null,null,"68-2091-1893"]
[null,null,"68-2092-1893"]
[null,null,"68-2108-0417"]
[null,null,"68-2112-1921"]
[null,null,"68-2134-0745"]
[null,null,"68-2152-1300"]
[null,null,"68-2179-0201"]
[null,null,"68-2200-1151"]
[null,null,"68-2208-0547"]
[null,null,"68-2208-0559"]
[null,null,"68-2208-0631"]
[null,null,"68-2210-0984"]
[null,null,"68-2210-1174"]
[null,null,"68-2211-1236"]
[null,null,"68-2213-2014"]
[null,null,"68-2213-2015"]
[null,null,"68-2213-2016"]
[null,null,"68-2213-2017"]
[null,null,"68-2220-0901"]
[null,null,"68-2291-2097"]
[null,null,"68-2296-0100"]
[null,null,"68-2305-0116"]
[null,null,"68-2309-0948"]
[null,null,"68-2310-2097"]
[null,null,"68-2315-2098"]
[null,null,"68-2348-0900"]
[null,null,"68-2387-0400"]

{"sheet":"Small Bridge Roads","index":5,"n_rows":405,"n_cols":5,"rows_kept":405,"cut":false,"hidden":true,"merged":[[1,4,8,4],[9,4,15,4],[16,4,22,4]]}
["County","Secondary","Township","Other","as of 08/19/2024"]
["03-0550-0604","04-2558-2093","02-1106-1835","46-3610-1350","This file is created by pasting in the Small Structure Inventory number from four separate files created by Kathryn Wesson of SDDOT's GIS group. Each of the four files lists small bridges, the reported latitude and longitude of which place them within 50' of a defined road system (County, County Secondary, Township, and Other). "]
["03-3652-0618","05-0472-1538","02-1320-1330","50-3075-1122"]
["03-3901-0619","05-0871-0371","02-1744-0409"]
["05-1603-1360","05-0871-1093","02-2008-1347"]
["05-1997-0400","05-0872-0840","02-2176-1528"]
["05-2026-0400","05-0934-0902","02-2381-1524"]
["08-1558-2113","05-1823-0300","03-0421-0712"]
["08-1558-2511","05-2056-0119","03-0737-0718"]
["08-1559-2114","05-2165-0883","03-3082-1927",null,"The Small Bridges worksheet uses this information to verify the road system reported for the structure in the Small Structure Inventory and to determine whether the structure is eligible for Rural Access Infrastructure Funding. (Only structures on Township and County Secondary roads are eligible.)"]
["14-1696-0757","05-2350-0052","03-3680-1133"]
["20-1311-0895","05-2456-0493","03-3706-1112"]
["20-1588-0839","10-1181-3706","03-3845-0934"]
["20-1616-0893","10-1215-3972","03-3939-2535"]
["20-2068-2535","10-3379-3411","03-3976-0735"]
["25-2397-1915","10-4881-2975","06-0244-0705"]
["25-2399-2274","17-1966-0611","07-0480-3805",null,"The information in this worksheet should be updated prior to local agencies updating the Small Structure Inventory each spring and again immediately before tallying the number of eligible small structure on June 1 of each year."]
["26-0100-0473","17-2020-0655","09-3030-1191"]
["26-2550-0790","17-2072-0691","12-3720-2180"]
["26-2560-1353","17-3644-0877","12-3803-2581"]
["26-2647-0634","17-3678-0861","12-3959-2936"]
["26-3651-1179","17-3701-0722","12-4104-2484"]
["39-2776-0014","17-3709-0873","12-4358-2608"]
["39-3083-2038","17-3736-0718","12-4449-1782"]
["47-0156-4135","17-3746-0544","12-5260-2836"]
["51-0099-0552","17-3749-0939","13-0477-2605"]
["51-1234-2008","17-3756-0578","14-0500-0572"]
["52-2657-4058","17-3761-0718","14-0795-1160"]
["52-2696-4083","17-3830-0468","14-1289-1502"]
["52-3961-3633","17-3887-0749","14-1297-1101"]
["52-4319-3821","17-3902-1119","14-1316-1101"]
["52-4570-4083","17-3925-0780","14-1398-1475"]
["58-1553-3321","17-4017-0816","14-1401-1603"]
["58-2193-1292","17-4151-0819","14-1494-0247"]
["58-2911-0217","17-4367-0529","14-1496-0586"]
["58-2935-3926","17-4836-2325","14-1496-0881"]
["58-3035-3344","17-4859-2237","14-1615-0451"]
["58-3185-0621","17-4994-1396","15-0203-1549"]
["58-3440-0623","17-5195-1361","15-1996-0935"]
["58-3530-1325","17-5261-1370","15-2508-0610"]
["63-0314-1453","24-4591-0241","18-1140-2339"]
["63-0945-0082","27-0683-3339","18-1156-2339"]
["63-1215-2473","28-2200-2679","18-1572-1334"]
["63-1215-2548","32-1144-3564","19-0203-1128"]
[null,"32-1523-3064","19-0313-0705"]
[null,"35-0166-4312","19-0533-0706"]
[null,"37-1380-1101","19-0601-2054"]
[null,"37-1921-0192","19-0898-0923"]
[null,"41-1263-1479","19-1083-0004"]
[null,"41-1581-1772","20-0606-2998"]
[null,"41-2322-1463","20-0893-2597"]
[null,"41-2325-1456","20-0896-2702"]
[null,"45-1199-1168","20-1195-2325"]
[null,"45-4771-1616","20-1396-2939"]
[null,"48-1496-2200","20-1594-2494"]
[null,"52-1586-2628","20-1611-0205"]
[null,"52-4595-3365","20-1963-1391"]
[null,"52-5315-3528","20-2044-0506"]
[null,"52-5345-3566","22-1473-0888"]
[null,"52-6089-2765","22-2415-1694"]
[null,"53-1732-6206","22-2463-1697"]
[null,"53-2096-1564","22-2517-1102"]
[null,"53-2262-0658","22-2702-1244"]
[null,"60-2682-0992","22-2898-1694"]
[null,"60-4340-2117","25-2142-1403"]
[null,"60-4584-2220","25-2930-0004"]
[null,"68-0100-0322","26-0285-0505"]
[null,"68-0101-0279","26-1371-0146"]
[null,"68-0218-1405","26-1800-0815"]
[null,"68-0311-1606","26-1868-0490"]
[null,"68-0378-0406","26-1961-0795"]
[null,"68-0611-1602","26-1968-0554"]
[null,"68-1099-0634","26-2062-0822"]
[null,null,"26-2062-0834"]
[null,null,"26-2063-0914"]
[null,null,"26-2165-1093"]
[null,null,"26-2168-0544"]
[null,null,"26-2239-1621"]
[null,null,"26-2354-0204"]
[null,null,"26-2359-0860"]
[null,null,"26-2365-0165"]
[null,null,"26-2370-2031"]
[null,null,"26-2376-2406"]
[null,null,"26-2470-1975"]
[null,null,"26-2573-2262"]
[null,null,"26-2682-0009"]
[null,null,"26-2764-1579"]
[null,null,"26-3467-2385"]
[null,null,"26-3496-0914"]
[null,null,"26-3663-1215"]
[null,null,"26-3754-1544"]
[null,null,"29-0598-1660"]
[null,null,"29-0599-1276"]
[null,null,"29-0796-0719"]
[null,null,"29-0796-1284"]
[null,null,"29-1001-1804"]
[null,null,"29-1292-0652"]
[null,null,"29-1414-0804"]
[null,null,"29-1440-1721"]
[null,null,"29-2325-0102"]
[null,null,"29-2616-0103"]
[null,null,"30-0329-3429"]
[null,null,"30-0705-2637"]
[null,null,"30-0729-4591"]
[null,null,"30-0729-4592"]
[null,null,"30-0732-2655"]
[null,null,"30-0910-2637"]
[null,null,"30-0951-2637"]
[null,null,"30-0963-2737"]
[null,null,"30-1225-3137"]
[null,null,"30-1269-2636"]
[null,null,"30-1330-3138"]
[null,null,"30-1569-2738"]
[null,null,"30-2158-2839"]
[null,null,"30-2427-0308"]
[null,null,"30-2625-3841"]
[null,null,"31-0233-1476"]
[null,null,"31-0239-0620"]
[null,null,"31-1245-1822"]
[null,null,"31-1311-0523"]
[null,null,"31-1330-2424"]
[null,null,"31-1410-2324"]
[null,null,"31-1413-2351"]
[null,null,"34-0113-1896"]
[null,null,"34-0168-1896"]
[null,null,"34-0219-0600"]
[null,null,"34-0238-0600"]
[null,null,"34-0491-0462"]
[null,null,"34-0621-1995"]
[null,null,"34-0639-1695"]
[null,null,"34-0666-0299"]
[null,null,"34-0739-1694"]
[null,null,"34-0813-1781"]
[null,null,"34-0892-0588"]
[null,null,"34-0912-1737"]
[null,null,"34-0974-1099"]
[null,null,"34-1201-1252"]
[null,null,"34-1296-1255"]
[null,null,"34-1299-1686"]
[null,null,"34-1350-1485"]
[null,null,"34-1501-1636"]
[null,null,"34-2019-1488"]
[null,null,"34-2994-1388"]
[null,null,"34-3000-1771"]
[null,null,"34-3190-1886"]
[null,null,"34-3556-1984"]
[null,null,"35-1631-2118"]
[null,null,"37-0792-1682"]
[null,null,"37-1965-0792"]
[null,null,"37-2024-0795"]
[null,null,"37-2032-0795"]
[null,null,"37-2460-1277"]
[null,null,"37-2695-0790"]
[null,null,"37-2765-0588"]
[null,null,"37-2824-1491"]
[null,null,"37-2840-1491"]
[null,null,"37-2910-1289"]
[null,null,"39-0099-0529"]
[null,null,"39-2780-0007"]
[null,null,"39-3135-2089"]
[null,null,"40-0155-1099"]
[null,null,"40-0592-0195"]
[null,null,"40-1119-0376"]
[null,null,"40-1595-0914"]
[null,null,"40-1599-2030"]
[null,null,"40-1694-0756"]
[null,null,"40-1698-1866"]
[null,null,"40-1701-2332"]
[null,null,"40-1701-2385"]
[null,null,"40-1710-2303"]
[null,null,"40-1711-2403"]
[null,null,"40-1761-1904"]
[null,null,"40-1886-0198"]
[null,null,"40-1891-0820"]
[null,null,"40-2310-0699"]
[null,null,"42-0003-1943"]
[null,null,"42-0301-2467"]
[null,null,"42-1595-2652"]
[null,null,"44-0397-0260"]
[null,null,"44-0398-2013"]
[null,null,"44-1429-2212"]
[null,null,"44-1548-0613"]
[null,null,"44-1996-0661"]
[null,null,"44-2081-2213"]
[null,null,"45-4475-0021"]
[null,null,"46-0500-1991"]
[null,null,"46-0601-1903"]
[null,null,"46-0734-2104"]
[null,null,"46-0770-2104"]
[null,null,"46-0791-2004"]
[null,null,"46-1053-2105"]
[null,null,"46-1200-2135"]
[null,null,"46-1258-1303"]
[null,null,"46-1299-1651"]
[null,null,"46-1301-1829"]
[null,null,"46-1401-1144"]
[null,null,"46-1401-1174"]
[null,null,"46-1426-1204"]
[null,null,"46-1800-1251"]
[null,null,"46-2201-0604"]
[null,null,"46-2971-0301"]
[null,null,"46-3256-1826"]
[null,null,"46-3411-0259"]
[null,null,"49-0100-1409"]
[null,null,"49-0143-1387"]
[null,null,"49-0163-1186"]
[null,null,"49-0355-0786"]
[null,null,"49-0420-0585"]
[null,null,"49-0702-2366"]
[null,null,"49-0800-1938"]
[null,null,"49-0929-0005"]
[null,null,"49-0947-0991"]
[null,null,"49-1195-0712"]
[null,null,"49-1196-0981"]
[null,null,"49-1627-0994"]
[null,null,"49-1793-0950"]
[null,null,"49-1916-0794"]
[null,null,"49-2362-0693"]
[null,null,"49-2385-0794"]
[null,null,"49-2398-2019"]
[null,null,"49-2398-2064"]
[null,null,"50-0199-0168"]
[null,null,"50-0299-1637"]
[null,null,"50-0349-1713"]
[null,null,"50-0369-0910"]
[null,null,"50-0498-0057"]
[null,null,"50-0511-0009"]
[null,null,"50-0600-1805"]
[null,null,"50-0936-1110"]
[null,null,"50-0991-1711"]
[null,null,"50-1195-1312"]
[null,null,"50-1486-0275"]
[null,null,"50-1493-1568"]
[null,null,"50-1767-1111"]
[null,null,"50-1819-0009"]
[null,null,"50-1821-0811"]
[null,null,"50-1841-1381"]
[null,null,"50-1874-0108"]
[null,null,"50-1889-0957"]
[null,null,"50-1890-0463"]
[null,null,"50-1955-0710"]
[null,null,"50-1965-0811"]
[null,null,"50-1988-0810"]
[null,null,"50-2004-0861"]
[null,null,"50-2116-0412"]
[null,null,"50-2170-0288"]
[null,null,"50-2188-0576"]
[null,null,"50-2188-0760"]
[null,null,"50-2586-0738"]
[null,null,"50-2681-0043"]
[null,null,"50-2682-0516"]
[null,null,"50-2689-1477"]
[null,null,"50-2689-1510"]
[null,null,"50-2807-0912"]
[null,null,"50-2819-2313"]
[null,null,"50-2873-2112"]
[null,null,"50-2883-0563"]
[null,null,"50-2889-1093"]
[null,null,"50-2904-1912"]
[null,null,"50-2965-1314"]
[null,null,"50-3009-1315"]
[null,null,"50-3075-1314"]
[null,null,"50-3088-1220"]
[null,null,"50-3090-2245"]
[null,null,"50-3093-2141"]
[null,null,"50-3115-2315"]
[null,null,"50-3146-2112"]
[null,null,"50-3184-0627"]
[null,null,"50-3185-0661"]
[null,null,"50-3190-2152"]
[null,null,"50-3206-1610"]
[null,null,"50-3241-2112"]
[null,null,"50-3288-1367"]
[null,null,"50-3288-1652"]
[null,null,"50-3289-0933"]
[null,null,"51-0031-0403"]
[null,null,"51-0152-0203"]
[null,null,"51-0158-0105"]
[null,null,"51-0158-0106"]
[null,null,"51-0704-0055"]
[null,null,"51-1099-1782"]
[null,null,"51-1398-1909"]
[null,null,"51-1587-2109"]
[null,null,"51-1888-0704"]
[null,null,"51-1904-0814"]
[null,null,"53-0392-4264"]
[null,null,"55-0222-1106"]
[null,null,"55-0402-0354"]
[null,null,"55-0404-1291"]
[null,null,"55-0505-1401"]
[null,null,"55-0539-1007"]
[null,null,"55-0655-4314"]
[null,null,"55-0705-1303"]
[null,null,"55-0745-2408"]
[null,null,"55-0770-0903"]
[null,null,"55-0804-1368"]
[null,null,"55-0900-1214"]
[null,null,"55-1107-2859"]
[null,null,"55-1109-3413"]
[null,null,"55-1376-3113"]
[null,null,"55-1578-4134"]
[null,null,"55-1579-4133"]
[null,null,"55-1672-3913"]
[null,null,"55-1678-3627"]
[null,null,"55-1678-3645"]
[null,null,"55-1678-3863"]
[null,null,"55-1679-3898"]
[null,null,"55-1703-1694"]
[null,null,"55-1703-1736"]
[null,null,"55-2413-4012"]
[null,null,"55-2748-0297"]
[null,null,"56-0103-1069"]
[null,null,"56-0121-1087"]
[null,null,"56-1198-0409"]
[null,null,"56-1593-1693"]
[null,null,"56-1800-2060"]
[null,null,"56-1800-2102"]
[null,null,"56-1990-1009"]
[null,null,"56-1991-1022"]
[null,null,"56-2157-0390"]
[null,null,"56-2293-1597"]
[null,null,"56-2320-1496"]
[null,null,"56-2369-0093"]
[null,null,"56-2383-1496"]
[null,null,"58-0134-3309"]
[null,null,"58-0552-3311"]
[null,null,"58-0657-2825"]
[null,null,"58-0851-2653"]
[null,null,"58-0851-2691"]
[null,null,"58-0851-2716"]
[null,null,"58-1473-3221"]
[null,null,"58-1648-3341"]
[null,null,"58-1845-3268"]
[null,null,"58-1999-3726"]
[null,null,"58-2598-2262"]
[null,null,"58-2839-3784"]
[null,null,"58-2871-3725"]
[null,null,"58-3025-3326"]
[null,null,"58-3030-3226"]
[null,null,"58-3333-3195"]
[null,null,"58-3337-3604"]
[null,null,"58-3474-0323"]
[null,null,"62-1019-1883"]
[null,null,"62-1376-2527"]
[null,null,"62-1924-5061"]
[null,null,"62-2069-2827"]
[null,null,"62-3015-4241"]
[null,null,"62-3146-3829"]
[null,null,"63-0010-1904"]
[null,null,"63-0060-0786"]
[null,null,"63-0100-2184"]
[null,null,"63-0219-2231"]
[null,null,"63-0587-2183"]
[null,null,"63-0625-1683"]
[null,null,"63-0809-1219"]
[null,null,"63-0811-1269"]
[null,null,"63-1100-0007"]
[null,null,"63-1219-1581"]
[null,null,"63-1886-2782"]
[null,null,"63-1964-0274"]
[null,null,"63-2391-0285"]
[null,null,"64-0103-2128"]
[null,null,"64-0188-0602"]
[null,null,"64-0204-0565"]
[null,null,"64-0260-0201"]
[null,null,"64-0279-1504"]
[null,null,"64-0295-0601"]
[null,null,"64-0304-0595"]
[null,null,"64-0304-0613"]
[null,null,"64-0305-0601"]
[null,null,"64-0306-1015"]
[null,null,"64-0306-1192"]
[null,null,"64-0374-1403"]
[null,null,"64-0403-1370"]
[null,null,"64-0519-0800"]
[null,null,"64-0527-0301"]
[null,null,"64-0597-1201"]
[null,null,"64-0638-0706"]
[null,null,"64-0655-0706"]
[null,null,"64-0702-0450"]
[null,null,"64-0814-1527"]
[null,null,"64-0896-0807"]
[null,null,"64-0985-1108"]
[null,null,"64-1020-0908"]
[null,null,"64-1064-0808"]
[null,null,"64-1149-1505"]
[null,null,"64-1183-1305"]
[null,null,"64-1199-0908"]
[null,null,"64-1317-0809"]
[null,null,"64-1400-0119"]
[null,null,"64-1449-0104"]
[null,null,"68-1261-0404"]
[null,null,"68-1304-0504"]
[null,null,"68-1707-0598"]
[null,null,"68-1711-1168"]
[null,null,"68-1713-1357"]
[null,null,"68-1715-1564"]
[null,null,"68-1742-1603"]
[null,null,"68-1858-0902"]
[null,null,"68-1909-0609"]
[null,null,"68-1910-0993"]
[null,null,"68-1911-1365"]
[null,null,"68-1911-1600"]
[null,null,"68-1927-1702"]
[null,null,"68-2012-1501"]

{"sheet":"Unique","index":6,"n_rows":2,"n_cols":6,"rows_kept":2,"cut":false,"hidden":true,"merged":[]}
["ALL","ALL","ALL","ALL","ALL","ALL"]
["ALL","ALL","ALL","ALL","ALL","ALL"]

{"sheet":"Import Culverts","index":7,"n_rows":27,"n_cols":5,"rows_kept":27,"cut":false,"hidden":false,"merged":[[24,4,27,4],[1,1,4,2],[5,1,5,2],[6,1,10,1],[6,2,10,2],[11,2,17,2],[18,1,25,1],[18,2,25,2],[11,1,17,1],[26,1,32,1],[26,2,32,2],[1,4,5,4],[6,4,10,4],[12,4,16,4],[17,4,18,4],[19,4,23,4]]}
[]
[null,"Import Culverts Worksheet Instructions\n\nTo use any functions of this Excel workbook, you must first import culvert and small bridge inventory data from the South Dakota Small Structure Inventory.  To access the inventory, click on this link:",null,null,"                                                          Culverts Worksheet Instructions\n\nIf you exported your county's culverts from the SD Small Structure Inventory,  the Culverts tab of this spreadsheet will contain all of your county's culverts when Import Culverts is completed. \n\nThe Culverts tab consists of two areas. \n\n"]
[]
[]
[]
[null,"https://sdgis.sd.gov/portal/apps/webappviewer/index.html?id=110201c952074157afd8a57fed789a58"]
[null,"To export culverts from the Small Structure Inventory, select the Small Structure Inventory Culvert tab and then click on the Filter option.",null,null,"Columns AI - CN contain a copy of the culvert data exported from the SD Small Structure\nInventory, listed in order of Small Structure Number. This data should not be altered. Changes\nmade here do not cause corresponding changes to be made in the SD Small Structure Inventory.\nIn this area, missing values are shaded light orange. Questionable values are marked in red.\nCounties should strive to identify the nature of the errors and make corrections in the SD Small\nStructure Inventory. After corrections are made, the Import Culverts can be repeated to keep\nthis Excel workbook consistent. "]
[]
[]
[]
[]
[null,null,"It is highly recommended to select only your county. Click on Add Expression, select Item 1 County Name, and then select your county from the drop-down list that appears. Click OK to complete your selection."]
[null,null,null,null,"Columns A - AH contain formulas that:\n    * Check whether the culvert locations, as determined from the reported latitude and longitude, lie\n       near the reported Road System. For example, if the Road System was reported as \"Township\", \n      does the culvert actually lie near a township road or another type of road? If the culvert clearly\n      lies along a Road Type different from that reported, the Road Type is changed. Only Township\n      and County Secondary roads are eligible for funding from the Rural Access Infrastructure Fund."]
[]
[]
[]
[]
[null,null,null,null,{"$f":"\"       This check is performed using data on record at the South Dakota Department of\n       Transportation \"&'Culvert Roads'!E1&\".\"","v":"       This check is performed using data on record at the South Dakota Department of\n       Transportation as of 08/19/2024."}]
[null,"Return to Culvert, and click on Export all to CSV option.\n\nThe South Dakota Small Structure Inventory website will export a Comma Separated Value (CSV) file named Culvert, possibly with a number in parentheses, to the Downloads directory of your computer. This is the file that you will import into this spreadsheet."]
[null,null,null,null,"    * Indicate whether the reported  Maintenance Level makes the structure eligible for RAIF. Only\n       Full Maintenance roads are eligible.\n    * Identify closely-spaced culverts that can be considered single groups of culverts for purposes\n       of determining culvert cross-section area. Only culverts or groups of culverts with at least 16\n       square feet of cross-section area are eligible.\nThe formulas in Columns A-AH of the Culverts tab should not be altered in any way."]
[]
[]
[]
[]
[null,null,null,null,"If you have questions about any worksheet in this Excel workbook, please contact:\n\n      Dave Huft, South Dakota Department of Transportation\n      dave.huft@state.sd.us   605.773.3358"]
[]
[null,"Click on the Import Culverts button at right. When you are asked to select a file to import, select the CSV file that was exported from the Small Structure Inventory. The spreadsheet will import the data into the Culverts tab of this workbook, where it will be available to all report templates.\n\nDepending on the number of culverts in your county, this operation may take a couple of minutes to complete. Wait patiently for the hourglass symbol (6) to disappear and the screen to return to this worksheet."]

{"sheet":"Import Bridges","index":8,"n_rows":27,"n_cols":5,"rows_kept":27,"cut":false,"hidden":false,"merged":[[12,4,17,4],[20,4,23,4],[24,4,27,4],[1,4,5,4],[18,4,19,4],[6,4,11,4],[26,1,31,1],[26,2,31,2],[1,1,4,2],[5,1,5,2],[6,1,10,1],[6,2,10,2],[11,1,17,1],[11,2,17,2],[18,1,25,1],[18,2,25,2]]}
[]
[null,"Import Bridges Worksheet Instructions\n\nTo use any functions of this Excel workbook, you must first import culvert and small bridge inventory data from the South Dakota Small Structure Inventory.  To access the inventory, click on this link:",null,null,"                                                          Small Bridges Worksheet Instructions\n\nIf you exported your county's small bridges from the SD Small Structure Inventory,  the Small_Bridges tab of this spreadsheet will contain all of your county's small bridges when Import Bridges is completed. \n\nThe Small_Bridges tab consists of two areas. \n\n"]
[]
[]
[]
[null,"https://sdgis.sd.gov/portal/apps/webappviewer/index.html?id=110201c952074157afd8a57fed789a58"]
[null,"To export culverts from the Small Structure Inventory, select the Small Structure Inventory Small Bridge tab and then click on the Filter option.",null,null,"Columns L - AY contain a copy of the small bridge data exported from the SD Small Structure\nInventory, listed in order of Small Structure Number. This data should not be altered. Changes\nmade here do not cause corresponding changes to be made in the SD Small Structure Inventory.\nIn this area, missing values are shaded light orange. Questionable values are marked in red.\nCounties should strive to identify the nature of the errors and make corrections in the SD Small\nStructure Inventory. After corrections are made, the Import Bridges can be repeated to keep\nthis Excel workbook consistent. "]
[]
[]
[]
[]
[null,null,"It is highly recommended to select only your county. Click on Add Expression, select Item 1 County Name, and then select your county from the drop-down list that appears. Click OK to complete your selection."]
[null,null,null,null,"Columns A - K contain formulas that:\n    * Check whether each small bridge location, as determined from the reported latitude and\n       longitude, lies near the reported Road System. For example, if the Road System was reported\n       as \"Township\", does the small bridge actually lie near a township road or another type of\n       road? If the small bridge clearly lies along a Road Type different from what was reported, the\n       Road Type is changed Only Township and County Secondary roads are eligible for funding from\n       the Rural Access Infrastructure Fund."]
[]
[]
[]
[]
[]
[null,"Return to Small_Bridges, and click on Export all to CSV option.\n\nThe South Dakota Small Structure Inventory website will export a Comma Separated Value (CSV) file named Small Bridge, possibly with a number in parentheses, to the Downloads directory of your computer. This is the file that you will import into this spreadsheet.",null,null,{"$f":"\"       This check is performed using data on record at the South Dakota Department of\n       Transportation \"&'Small Bridge Roads'!E1&\".\"","v":"       This check is performed using data on record at the South Dakota Department of\n       Transportation as of 08/19/2024."}]
[]
[null,null,null,null,"    * Indicate whether the reported  Maintenance Level makes the structure eligible for RAIF. Only\n       Full Maintenance roads are eligible.\n\nThe formulas in Columns A-K of the Small_Bridges tab should not be altered in any way."]
[]
[]
[]
[null,null,null,null,"If you have questions about any worksheet in this Excel workbook, please contact:\n\n      Dave Huft, South Dakota Department of Transportation\n      dave.huft@state.sd.us   605.773.3358"]
[]
[null,"Click on the Import Bridges button at right. When you are asked to select a file to import, select the CSV file that was exported from the Small Structure Inventory. The spreadsheet will import the data into the Small_Bridges tab of this workbook, where it will be available to all report templates."]

{"sheet":"Culverts","index":9,"n_rows":3,"n_cols":94,"rows_kept":3,"cut":false,"hidden":false,"merged":[[0,1,0,6],[0,24,0,26],[0,27,0,32],[0,9,0,23],[0,33,0,34]]}
[null,{"$f":"\"Structure Maps to GIS Road Systems \"&'Culvert Roads'!E1","v":"Structure Maps to GIS Road Systems as of 06/21/2024"},null,null,null,null,null,null,null,"Culvert Grouping",null,null,null,null,null,null,null,null,null,null,null,null,null,null,"Pipes and Area for Row",null,null,"Pipes and Area for Group",null,null,null,null,null,"Eligible Structures:",null,{"$f":"SUM(AH:AH)","v":{"$error":"#VALUE!"}},"From File:","Culvert (75).csv","Imported:","2024-06-29T11:36:20"]
["Reported\nSystem","County","Secondary","Township","Other","All\nSystems","Mapped\nSystem\n(changes\n in red)","Eligible\nSystem","Highway\nMaintenance\nLevel","Seq #","No\nNearby\nCulvert","Nearest\nCulvert\nN & W\n(row)","Nearest\nCulvert\nN & W\nSmall\nStructure\nNumber","Distance\nto Nearest\nCulvert\nN & W\n(ft)","Nearest\nN & W\nCulvert\nw/in 120'\n(row)","Nearest\nCulvert\nS & E\n(row)","Nearest\nCulvert\nS & E\nSmall\nStructure\nNumber","Distance\nto Nearest\nCulvert\nS & E\n(ft)","Nearest\nS & E\nCulvert\nw/in 120'\n(row)","Start\nGroup","With\nGroup","# in\nGroup","Group\nwith Small\nStructure\n(row)","Group\nwith Small\nStructure\nNumber","Number of\nBarrels\n(changes\nin red)","Estimated\nCulvert\nOutlet Area\nft2","Number\nof\nBarrels\n≥16ft2","Number\n of\nBarrels","Culvert\nGroup\nEstimated\nOutlet Area ft2","Number\nof\nBarrels\n<16ft2","Small\nPipe\nEstimated\nOutlet\nArea ft2","# of\nOther\nGroups\n>16ft2","Total\nPossible\nSmall\nStructures","Eligible\nSmall\nStructures","Item 1\nCounty Name","Item 2\nTown or Township Name","Item 3\nRoad System","Item 4\nSmall Structure\n Local Identifier","Item 5\nSequence\nNumber","Item 6\nInventoried By","Item 7\nInventory Date","Item 8\nLatitude","Item 9\nLongitude","Item 10\nSmall Structure Number","Item 11\nRoad Name","Item 12\nRoad Maintenance Level","Item 13\nRoad Surface","Item 14\nNumber Served","Item 15\nDetour Length (in miles)","Item 16\nCulvert Purpose","Item 17\nCulvert Location","Item 18\nWater Overtop Frequency","Item 19\nCulvert Type","Item 20\nNumber of Cells","Item 21\nMaterial","Item 22\nLining","Item 23\nShape","Item 24\nSpan\n(in inches)","Item 25 Rise\n(in inches)","Item 26\nBarrel Length (in feet)","Item 27\nLength Along Roadway (in feet)","Item 28\nSkew Angle","Item 29\nCover Height\n(in feet)","Item 30\nCrushing","Item 31 Joint Separation","Item 32\nInfiltration","Item 33 Material Deterioration","Item 34 Damage","Item 35\nPlugging","Item 36 Embankment Settlement","Item 37\nRoad Surface Distress","Item 38\nInlet\nEnd Treatment","Item 39 Perched Inlet","Item 40\nInlet\nWater Level","Item 41\nInlet\nErosion Control","Item 42 Inlet Erosion","Item 43\nInlet \nErosion Outside\n of Right of Way","Item 44\nOutlet\nEnd Treatment","Item 45\nPerched Outlet","Item 46\nOutlet\nWater Level","Item 47\nOutlet\nErosion Control","Item 48\nOutlet Erosion","Item 49\nOulet\nErosion Outside\nof Right of Way","Item 65\nYear Constructed","Item 66 Overall Structure Condition","Item 67\nOther Comments","Item 68\nTraffic Status","Item 69\nAxle Weight Load Posting","Item 70 Load Posting for Single Unit Vehicles","Item 71 Load Posting for Combination Vehicles","Item 72\nLoad Rating Evaluation Recommended","Item 73\nFurther Inspection Needed","X","Y"]
[{"$f":"IF(AK3=\"County Secondary\",\"Secondary\",AK3)","v":0},{"$f":"IF(ISERROR(MATCH($AR3,'Culvert Roads'!A:A,0)),\"\",IF($A3=B$2,B$2,B$2&\"?\"))","v":""},{"$f":"IF(ISERROR(MATCH($AR3,'Culvert Roads'!B:B,0)),\"\",IF($A3=C$2,C$2,C$2&\"?\"))","v":""},{"$f":"IF(ISERROR(MATCH($AR3,'Culvert Roads'!C:C,0)),\"\",IF($A3=D$2,D$2,D$2&\"?\"))","v":""},{"$f":"IF(ISERROR(MATCH($AR3,'Culvert Roads'!D:D,0)),\"\",IF($A3=E$2,E$2,E$2&\"?\"))","v":""},{"$f":"SUBSTITUTE(CONCATENATE(B3,C3,D3,E3),\"?\",\"\")","v":""},{"$f":"IF(AND(LEN(F3)<>0,ISERROR(FIND(A3,F3))),F3,A3)","v":0},{"$f":"IF(G3=\"\",\"UNKNOWN\",IF(OR(G3=\"Township\",G3=\"Secondary\"),\"Yes\",\"No\"))","v":"No"},{"$f":"IFERROR(VLOOKUP(AT3,'Culvert Shapes'!D$2:E$4,2,FALSE),\"UNKNOWN\")","v":"UNKNOWN"},{"$f":"IF(AM3>0,AM3,\"\")","v":""},{"$f":"IF(AND(J3>1,O3=0,S3=0),\"No nearby culvert\",\"\")","v":{"$error":"#VALUE!"}},{"$f":"IF(J3=\"\",\"\",nearleft(ROW(J3),AP$3,AQ$3))","v":""},{"$f":"IF(L3=0,\"\",INDEX($AR:$AR,L3))","v":{"$error":"#VALUE!"}},{"$f":"IF(L3=0,1000000,GPxDistance(AP3,AQ3,INDEX(AP$1:AP$1996,L3),INDEX(AQ$1:AQ$1996,L3),\"F\"))","v":{"$error":"#VALUE!"}},{"$f":"IF(N3<120,L3,0)","v":{"$error":"#VALUE!"}},{"$f":"IF(J3=\"\",\"\",NearRight(ROW(J3),AP$3,AQ$3))","v":""},{"$f":"IF(P3=0,\"\",INDEX($AR:$AR,P3))","v":{"$error":"#VALUE!"}},{"$f":"IF(P3=0,1000000,GPxDistance(AP3,AQ3,INDEX(AP$1:AP$1996,P3),INDEX(AQ$1:AQ$1996,P3),\"F\"))","v":{"$error":"#VALUE!"}},{"$f":"IF(R3<120,P3,0)","v":{"$error":"#VALUE!"}},{"$f":"IF(AND(O3=0),MAX(T$2:T2)+1,\"\")","v":{"$error":"#VALUE!"}},{"$f":"IF(T3=\"\",IF(O3>0,INDEX(U:U,O3),IF(S3>1,INDEX(U:U,S3),\"\")),T3)","v":{"$error":"#VALUE!"}},{"$f":"IF(T3=\"\",\"\",COUNTIFS(U$3:U$98,T3))","v":{"$error":"#VALUE!"}},{"$f":"IF(U3=\"\",ROW(U3),_xlfn.XMATCH(U3,T:T,0))","v":{"$error":"#VALUE!"}},{"$f":"IF(W3=0,\"unknown\",INDEX(AR:AR,W3))","v":{"$error":"#VALUE!"}},{"$f":"MAX(1,IF(AND(COUNTIFS(U:U,U3)>1,BF3*BG3=SUMPRODUCT(--(U:U=U3),BF:BF,BG:BG)/COUNTIFS(U:U,U3)),1,BB3))","v":{"$error":"#VALUE!"}},{"$f":"ROUND(IFERROR(VLOOKUP(BE3,'Culvert Shapes'!A$2:B$10,2,FALSE),'Culvert Shapes'!B$10)*BF3*BG3*Y3,0)","v":{"$error":"#VALUE!"}},{"$f":"IF(Z3/Y3>=16,Y3,0)","v":{"$error":"#VALUE!"}},{"$f":"IF(T3=\"\",\"\",SUMIFS(Y:Y,U:U,T3))","v":{"$error":"#VALUE!"}},{"$f":"IF(AND(T3>0,T3<>\"\"),SUMIFS(Z:Z,U:U,U3),\"\")","v":{"$error":"#VALUE!"}},{"$f":"IF(AND(T3>0,T3<>\"\"),AB3-SUMIFS(AA:AA,U:U,U3),\"\")","v":{"$error":"#VALUE!"}},{"$f":"IF(AND(T3>0,T3<>\"\"),SUMIFS(Z:Z,U:U,U3,AA:AA,0),\"\")","v":{"$error":"#VALUE!"}},{"$f":"IF(T3=\"\",\"\",MIN(INT(AE3/16),INT(AD3/2)))","v":{"$error":"#VALUE!"}},{"$f":"IF(T3=\"\",\"\",AB3-AD3+AF3)","v":{"$error":"#VALUE!"}},{"$f":"IF(AND(H3=\"Yes\",I3<>\"No\",AG3>0),AG3,\"\")","v":{"$error":"#VALUE!"}}]

{"sheet":"Small_Bridges","index":10,"n_rows":3,"n_cols":51,"rows_kept":3,"cut":false,"hidden":false,"merged":[[0,26,0,38],[0,39,0,42],[0,43,0,48],[0,18,0,25],[0,1,0,6],[0,10,0,11],[0,16,0,17]]}
[null,{"$f":"\"Structure Maps to GIS Road Systems \"&'Small Bridge Roads'!E1","v":"Structure Maps to GIS Road Systems as of 06/21/2024"},null,null,null,null,null,null,null,null,"Eligible Structures:",null,{"$f":"COUNTIF(K:K,\"Yes\")","v":0},"From File:","Small Bridge (113).csv","Imported:","2024-06-29T11:36:40"]
["Reported\nSystem","County","Secondary","Township","Other","All\nSystems","Mapped\nSystem\n(changes\n in red)","Eligible\nSystem","Highway\nMaintenance\nLevel","NBIS\nBridge\nLength\n(ft)","Bridge\nRAIF\nEligible","Item 1\nCounty Name","Item 2\nTown or Township Name","Item 3\nRoad System","Item 4\nSmall Structure Local Identifier","Item 6\nInventoried By","Item 7\nInventory Date","Item 8\nLatitude","Item 9\nLongitude","Item 10\nSmall Structure Number","Item 11\nRoad Name","Item 12\nRoad Maintenance Level","Item 13\nRoad Surface","Item 14\nNumber Served","Item 15\nDetour Length (in miles)","Item 50\nStructure Design Type","Item 51\nStructure Material","Item 52\nOverall Length (in feet)","Item 53\nNBIS Length","Item 54\nNumber of Spans","Item 55\nTraffic Lanes","Item 56\nDeck Width\n(in feet)","Item 57\nRoadway Width\n(in feet)","Item 58\nSkew Angle","Item 59\nDeck Condition","Item 60\nSuperstructure Condition","Item 61\nSubstructure Condition","Item 62\nChannel Condition","Item 63\nBridge Rail Condition","Item 64\nApproach Rail","Item 65\nYear Constructed","Item 66\nOverall Structure Condition","Item 67\nOther Comments","Item 68\nTraffic Status","Item 69\nAxle Weight Load Posting","Item 70\nLoad Posting for Single Unit Vehicles","Item 71\nLoad Posting for Combination Vehicles","Item 72\nLoad Rating Evaluation Recommended","Item 73\nFurther Inspection Needed","X","Y"]
[{"$f":"IF(N3=\"County Secondary\",\"Secondary\",N3)","v":0},{"$f":"IF(ISERROR(MATCH($T3,'Small Bridge Roads'!A:A,0)),\"\",IF($A3=B$2,B$2,B$2&\"?\"))","v":""},{"$f":"IF(ISERROR(MATCH($T3,'Small Bridge Roads'!B:B,0)),\"\",IF($A3=C$2,C$2,C$2&\"?\"))","v":""},{"$f":"IF(ISERROR(MATCH($T3,'Small Bridge Roads'!C:C,0)),\"\",IF($A3=D$2,D$2,D$2&\"?\"))","v":""},{"$f":"IF(ISERROR(MATCH($AK3,'Small Bridge Roads'!D:D,0)),\"\",IF($A3=E$2,E$2,E$2&\"?\"))","v":""},{"$f":"SUBSTITUTE(CONCATENATE(B3,C3,D3,E3),\"?\",\"\")","v":""},{"$f":"IF(AND(LEN(F3)<>0,ISERROR(FIND(A3,F3))),F3,A3)","v":0},{"$f":"IF(G3=\"\",\"UNKNOWN\",IF(OR(G3=\"Township\",G3=\"Secondary\"),\"Yes\",\"No\"))","v":"No"},{"$f":"IFERROR(VLOOKUP(V3,'Culvert Shapes'!D$2:E$4,2,FALSE),\"UNKNOWN\")","v":"UNKNOWN"},{"$f":"AC3","v":0},{"$f":"IF(AND($H3=\"Yes\",$I3<>\"No\",J3<=20,J3>0),\"Yes\",\"No\")","v":"No"}]

{"sheet":"Culvert_Detail_Template","index":11,"n_rows":39,"n_cols":10,"rows_kept":39,"cut":false,"hidden":false,"merged":[[21,5,22,5],[33,1,33,2],[34,1,34,2],[36,1,36,5],[37,1,37,5],[38,1,38,5],[27,1,27,2],[28,1,28,2],[29,1,29,2],[30,1,30,2],[32,1,32,2],[20,1,20,2],[21,1,21,2],[22,1,22,2],[25,1,25,2],[26,1,26,2],[14,1,14,2],[15,1,15,2],[16,1,16,2],[18,1,18,2],[19,1,19,2],[8,1,8,2],[12,1,12,2],[9,1,9,2],[10,1,10,2],[13,1,13,2],[2,1,2,2],[3,1,3,2],[4,1,4,2],[5,1,5,2],[6,1,6,2],[0,7,38,7],[0,8,4,8],[35,0,35,5],[0,0,0,5],[7,0,7,5],[11,0,11,5],[17,0,17,5],[24,0,24,5],[31,0,31,5],[23,1,23,5],[9,3,9,4],[8,3,8,4],[10,3,10,4],[16,3,16,4],[19,3,19,4],[1,1,1,2]]}
["Culvert Identification  & Location",null,null,null,null,null,null,"Culvert Detail Worksheet Instructions\n\nThe Culvert Detail sheet reports all of the information contained in the South Dakota Small Inventory database for the culvert you select. Enter the Small Structure Number of the culvert you want reported in the tan cell F2.\n\nThe spreadsheet will populate the rests of the form with information that you have imported from the Small Structure Inventory database. \n\nYou may print this form to a printer or a PDF.\n\nThe form prints on one 8.½ x 11 page.\n\nTo Add Photographs to This Report\n\nAppending photographs to this report can add valuable information. Because of the wide variety of possible photographs sizes and orientations, this worksheet cannot import photographs automatically. However, photographs can be inserted manually in Columns A - F below Row 40.\n\nTo insert photographs, select Insert, then Pictures, then From this Device. Excel will ask you to select photographs from the folder where you have stored your .jpg or other graphic format files. After you insert images, you can resize and arrange them to fit on a second page of this report. Type in appropriate labels into cells below the photographs.","Hidden column J is used for calculations","Culverts Row"]
["County:",{"$f":"INDEX(Culverts!$AI:$CN,$J$2,1)","v":{"$error":"#VALUE!"}},null,null,"Small Structure Number:","ENTER SSN HERE",null,null,null,{"$f":"IFERROR(MATCH(F2,Culverts!AR:AR,0),\"Not Found\")","v":"Not Found"}]
["Township:",{"$f":"INDEX(Culverts!$AI:$CN,$J$2,2)","v":{"$error":"#VALUE!"}},null,null,"Local Identifier:",{"$f":"INDEX(Culverts!$AI:$CN,$J$2,4)","v":{"$error":"#VALUE!"}}]
["Road System:",{"$f":"INDEX(Culverts!$A:$AH,$J$2,6)","v":{"$error":"#VALUE!"}},null,null,"Latitude:",{"$f":"INDEX(Culverts!$AI:$CN,$J$2,8)","v":{"$error":"#VALUE!"}}]
["Road Name:",{"$f":"INDEX(Culverts!$AI:$CN,$J$2,11)","v":{"$error":"#VALUE!"}},null,null,"Longitude:",{"$f":"INDEX(Culverts!$AI:$CN,$J$2,9)","v":{"$error":"#VALUE!"}}]
["Maintenance Level:",{"$f":"INDEX(Culverts!$AI:$CN,$J$2,12)","v":{"$error":"#VALUE!"}},null,null,"Number Served:",{"$f":"INDEX(Culverts!$AI:$CN,$J$2,14)","v":{"$error":"#VALUE!"}}]
["Road Surface:",{"$f":"INDEX(Culverts!$AI:$CN,$J$2,13)","v":{"$error":"#VALUE!"}},null,null,"Detour Length:",{"$f":"INDEX(Culverts!$AI:$CN,$J$2,15)&\" miles\"","v":{"$error":"#VALUE!"}}]
["Culvert Identification  & Location"]
["Culvert Purpose:",{"$f":"INDEX(Culverts!$AI:$CN,$J$2,16)","v":{"$error":"#VALUE!"}},null,"Culvert Type:",null,{"$f":"INDEX(Culverts!$AI:$CN,$J$2,19)","v":{"$error":"#VALUE!"}}]
["Culvert Location:",{"$f":"INDEX(Culverts!$AI:$CN,$J$2,17)","v":{"$error":"#VALUE!"}},null,"Year Built:",null,{"$f":"INDEX(Culverts!$AI:$CN,$J$2,50)","v":{"$error":"#VALUE!"}}]
["Overtop Frequency:",{"$f":"INDEX(Culverts!$AI:$CN,$J$2,18)","v":{"$error":"#VALUE!"}},null,"Lining:",null,{"$f":"INDEX(Culverts!$AI:$CN,$J$2,22)","v":{"$error":"#VALUE!"}}]
["Culvert Dimensions"]
["Culvert Shape:",{"$f":"INDEX(Culverts!$AI:$CN,$J$2,23)","v":{"$error":"#VALUE!"}},null,null,"Barrel Length:",{"$f":"INDEX(Culverts!$AI:$CN,$J$2,26)&\" feet\"","v":{"$error":"#VALUE!"}}]
["Culvert Material:",{"$f":"INDEX(Culverts!$AI:$CN,$J$2,21)","v":{"$error":"#VALUE!"}},null,null,"Roadway Length:",{"$f":"INDEX(Culverts!$AI:$CN,$J$2,27)&\" feet\"","v":{"$error":"#VALUE!"}}]
["Number of Cells:",{"$f":"INDEX(Culverts!$AI:$CN,$J$2,20)","v":{"$error":"#VALUE!"}},null,null,"Skew Angle:",{"$f":"VALUE(INDEX(Culverts!$AI:$CN,$J$2,28))&\" degrees\"","v":{"$error":"#VALUE!"}}]
["Span:",{"$f":"INDEX(Culverts!$AI:$CN,$J$2,24)&\" inches\"","v":{"$error":"#VALUE!"}},null,null,"Cover Height:",{"$f":"INDEX(Culverts!$AI:$CN,$J$2,29)&\" feet\"","v":{"$error":"#VALUE!"}}]
["Rise:",{"$f":"INDEX(Culverts!$AI:$CN,$J$2,25)&\" inches\"","v":{"$error":"#VALUE!"}},null,"Cross Section Area:",null,{"$f":"IFERROR(ROUND(VLOOKUP(B13,'Culvert Shapes'!A2:B9,2,0)*INDEX(Culverts!$AI:$CN,$J$2,24)*INDEX(Culverts!$AI:$CN,$J$2,25),1)&\" sq ft\",\"UNKNOWN\")","v":"UNKNOWN"}]
["Culvert Condition"]
["Overall Condition:",{"$f":"INDEX(Culverts!$AI:$CN,$J$2,51)","v":{"$error":"#VALUE!"}},null,null,"Physical Damage:",{"$f":"INDEX(Culverts!$AI:$CN,$J$2,34)","v":{"$error":"#VALUE!"}}]
["Crushing:",{"$f":"INDEX(Culverts!$AI:$CN,$J$2,30)","v":{"$error":"#VALUE!"}},null,"Plugging:",null,{"$f":"INDEX(Culverts!$AI:$CN,$J$2,35)","v":{"$error":"#VALUE!"}}]
["Joint Separation:",{"$f":"INDEX(Culverts!$AI:$CN,$J$2,31)","v":{"$error":"#VALUE!"}},null,null,"Embankment Settlement:",{"$f":"INDEX(Culverts!$AI:$CN,$J$2,36)","v":{"$error":"#VALUE!"}}]
["Infiltration:",{"$f":"INDEX(Culverts!$AI:$CN,$J$2,32)","v":{"$error":"#VALUE!"}},null,null,"Road Surface Distress:",{"$f":"INDEX(Culverts!$AI:$CN,$J$2,37)","v":{"$error":"#VALUE!"}}]
["Material Deterioration:",{"$f":"INDEX(Culverts!$AI:$CN,$J$2,33)","v":{"$error":"#VALUE!"}}]
["Other\nComments:",{"$f":"INDEX(Culverts!$AI:$CN,$J$2,38)","v":{"$error":"#VALUE!"}}]
["End Treatments and Erosion Control"]
["Inlet End Treatment:",{"$f":"INDEX(Culverts!$AI:$CN,$J$2,38)","v":{"$error":"#VALUE!"}},null,null,"Outlet End Treatment:",{"$f":"INDEX(Culverts!$AI:$CN,$J$2,44)","v":{"$error":"#VALUE!"}}]
["Perched Inlet?",{"$f":"INDEX(Culverts!$AI:$CN,$J$2,39)","v":{"$error":"#VALUE!"}},null,null,"Perched Outlet?",{"$f":"INDEX(Culverts!$AI:$CN,$J$2,45)","v":{"$error":"#VALUE!"}}]
["Inlet Water Level:",{"$f":"INDEX(Culverts!$AI:$CN,$J$2,40)","v":{"$error":"#VALUE!"}},null,null,"Outlet Water Level:",{"$f":"INDEX(Culverts!$AI:$CN,$J$2,46)","v":{"$error":"#VALUE!"}}]
["Inlet Erosion Control:",{"$f":"INDEX(Culverts!$AI:$CN,$J$2,41)","v":{"$error":"#VALUE!"}},null,null,"Outlet Erosion Control:",{"$f":"INDEX(Culverts!$AI:$CN,$J$2,47)","v":{"$error":"#VALUE!"}}]
["Inlet Erosion:",{"$f":"INDEX(Culverts!$AI:$CN,$J$2,42)","v":{"$error":"#VALUE!"}},null,null,"Outlet Erosion:",{"$f":"INDEX(Culverts!$AI:$CN,$J$2,48)","v":{"$error":"#VALUE!"}}]
["Erosion Outside ROW:",{"$f":"INDEX(Culverts!$AI:$CN,$J$2,43)","v":{"$error":"#VALUE!"}},null,null,"Erosion Outside ROW:",{"$f":"INDEX(Culverts!$AI:$CN,$J$2,49)","v":{"$error":"#VALUE!"}}]
["Load Postings"]
["Traffic Status:",{"$f":"INDEX(Culverts!$AI:$CN,$J$2,53)","v":{"$error":"#VALUE!"}},null,null,"Single Unit Vehicle Posting:",{"$f":"IF(INDEX(Culverts!$AI:$CN,$J$2,55)=0,\"None\",INDEX(Culverts!$AI:$CN,$J$2,55)&\" tons\")","v":{"$error":"#VALUE!"}}]
["Axle Weight Posting:",{"$f":"IF(INDEX(Culverts!$AI:$CN,$J$2,54)=0,\"None\",INDEX(Culverts!$AI:$CN,$J$2,54)&\" tons\")","v":{"$error":"#VALUE!"}},null,null,"Combination Vehicle Posting:",{"$f":"IF(INDEX(Culverts!$AI:$CN,$J$2,56)=0,\"None\",INDEX(Culverts!$AI:$CN,$J$2,56)&\" tons\")","v":{"$error":"#VALUE!"}}]
["Load Rating Recommended?",{"$f":"IF(INDEX(Culverts!$AI:$CN,$J$2,57)=0,\"None noted\",INDEX(Culverts!$AI:$CN,$J$2,57))","v":{"$error":"#VALUE!"}}]
["Inspection Record"]
["Inventory By:",{"$f":"INDEX(Culverts!$AI:$CN,$J$2,6)","v":{"$error":"#VALUE!"}}]
["Inventory Date:",{"$f":"INDEX(Culverts!$AI:$CN,$J$2,7)","v":{"$error":"#VALUE!"}}]
["Further Inspection Needed?",{"$f":"INDEX(Culverts!$AI:$CN,$J$2,58)","v":{"$error":"#VALUE!"}}]

{"sheet":"Bridge_Detail_Template","index":12,"n_rows":30,"n_cols":10,"rows_kept":30,"cut":false,"hidden":false,"merged":[[0,8,4,8],[7,0,7,5],[10,0,10,5],[15,0,15,5],[1,1,1,2],[2,1,2,2],[3,1,3,2],[4,1,4,2],[5,1,5,2],[6,1,6,2],[8,1,8,2],[0,7,29,7],[21,1,21,5],[27,1,27,5],[29,1,29,5],[22,0,22,5],[28,1,28,5],[0,0,0,5],[17,2,17,3],[18,2,20,2],[18,3,20,5],[13,1,13,2],[14,1,14,2],[9,1,9,2],[11,1,11,2],[12,1,12,2],[26,0,26,5]]}
["Small Bridge Identification  & Location",null,null,null,null,null,null,"Bridge Detail Worksheet Instructions\n\nThe Bridge Detail sheet reports all of the information contained in the South Dakota Small Inventory database for the small bridge you select. Enter the Small Structure Number of the small bridge you want reported in the tan cell F2.\n\nThe spreadsheet will populate the rests of the form with information that you have imported from the Small Structure Inventory database. \n\nYou may print this form to a printer or a Portable Document Format (PDF) file.\n\nThe form prints on one 8½ x 11 page.\n\nTo Add Photographs to This Report\n\nAppending photographs to this report can add valuable information. Because of the wide variety of possible photographs sizes and orientations, this worksheet cannot import photographs automatically. However, photographs can be inserted manually in Columns A - F below Row 31.\n\nTo insert photographs, select Insert, then Pictures, then From this Device. Excel will ask you to select photographs from the folder where you have stored your .jpg or other graphic format files. After you insert images, you can resize and arrange them to fit on a second page of this report.","Hidden column J is used for calculations","Bridges Row"]
["County:",{"$f":"INDEX(Small_Bridges!$L:$AY,$J$2,1)","v":{"$error":"#VALUE!"}},null,null,"Small Structure Number:","ENTER SSN HERE",null,null,null,{"$f":"IFERROR(MATCH(F2,Small_Bridges!T:T,0),\"Not Found\")","v":"Not Found"}]
["Township:",{"$f":"INDEX(Small_Bridges!$L:$AY,$J$2,2)","v":{"$error":"#VALUE!"}},null,null,"Local Identifier:",{"$f":"INDEX(Small_Bridges!$L:$AY,$J$2,4)","v":{"$error":"#VALUE!"}}]
["Road System:",{"$f":"INDEX(Small_Bridges!$A:$AF,$J$2,6)","v":{"$error":"#VALUE!"}},null,null,"Latitude:",{"$f":"INDEX(Small_Bridges!$L:$AY,$J$2,7)","v":{"$error":"#VALUE!"}}]
["Road Name:",{"$f":"INDEX(Small_Bridges!$L:$AY,$J$2,10)","v":{"$error":"#VALUE!"}},null,null,"Longitude:",{"$f":"INDEX(Small_Bridges!$L:$AY,$J$2,8)","v":{"$error":"#VALUE!"}}]
["Maintenance Level:",{"$f":"INDEX(Small_Bridges!$L:$AY,$J$2,11)","v":{"$error":"#VALUE!"}},null,null,"Number Served:",{"$f":"INDEX(Small_Bridges!$L:$AY,$J$2,13)","v":{"$error":"#VALUE!"}}]
["Road Surface:",{"$f":"INDEX(Small_Bridges!$L:$AY,$J$2,12)","v":{"$error":"#VALUE!"}},null,null,"Detour Length:",{"$f":"INDEX(Small_Bridges!$L:$AY,$J$2,14)&\" miles\"","v":{"$error":"#VALUE!"}}]
["Small Bridge Design"]
["Structure Design:",{"$f":"INDEX(Small_Bridges!$L:$AY,$J$2,15)","v":{"$error":"#VALUE!"}},null,null,"Year Built:",{"$f":"INDEX(Small_Bridges!$L:$AY,$J$2,30)","v":{"$error":"#VALUE!"}}]
["Structure Material:",{"$f":"INDEX(Small_Bridges!$L:$AY,$J$2,16)","v":{"$error":"#VALUE!"}}]
["Small Bridge Dimensions"]
["Overall Length:",{"$f":"INDEX(Small_Bridges!$L:$AY,$J$2,17)&\" feet\"","v":{"$error":"#VALUE!"}},null,null,"Traffic Lanes:",{"$f":"INDEX(Small_Bridges!$L:$AY,$J$2,20)","v":{"$error":"#VALUE!"}}]
["NBIS Length:",{"$f":"INDEX(Small_Bridges!$L:$AY,$J$2,18)&\" feet\"","v":{"$error":"#VALUE!"}},null,null,"Deck Width:",{"$f":"INDEX(Small_Bridges!$L:$AY,$J$2,21)&\" feet\"","v":{"$error":"#VALUE!"}}]
["Number of Spans:",{"$f":"INDEX(Small_Bridges!$L:$AY,$J$2,19)","v":{"$error":"#VALUE!"}},null,null,"Roadway Width:",{"$f":"INDEX(Small_Bridges!$L:$AY,$J$2,22)&\" feet\"","v":{"$error":"#VALUE!"}}]
["Skew Angle:",{"$f":"INDEX(Small_Bridges!$L:$AY,$J$2,23)&\" degrees\"","v":{"$error":"#VALUE!"}}]
["Small Bridge Condition"]
["Overall Condition:",{"$f":"INDEX(Small_Bridges!$L:$AY,$J$2,31)","v":{"$error":"#VALUE!"}},null,"Bridge Rail Condition:",{"$f":"INDEX(Small_Bridges!$L:$AY,$J$2,28)","v":{"$error":"#VALUE!"}}]
["Deck Condition:",{"$f":"INDEX(Small_Bridges!$L:$AY,$J$2,24)","v":{"$error":"#VALUE!"}},"Approach Rail Condition:",null,{"$f":"INDEX(Small_Bridges!$L:$AY,$J$2,29)","v":{"$error":"#VALUE!"}}]
["Superstructure Condition:",{"$f":"INDEX(Small_Bridges!$L:$AY,$J$2,25)","v":{"$error":"#VALUE!"}}]
["Substructure Condition:",{"$f":"INDEX(Small_Bridges!$L:$AY,$J$2,26)","v":{"$error":"#VALUE!"}}]
["Channel Condition:",{"$f":"INDEX(Small_Bridges!$L:$AY,$J$2,27)","v":{"$error":"#VALUE!"}}]
["Other\nComments:",{"$f":"INDEX(Small_Bridges!$L:$AY,$J$2,32)","v":{"$error":"#VALUE!"}}]
["Load Postings"]
["Traffic Status:",{"$f":"INDEX(Small_Bridges!$L:$AY,$J$2,33)","v":{"$error":"#VALUE!"}},null,null,"Single Unit Vehicle Posting:",{"$f":"IF(INDEX(Small_Bridges!$L:$AY,$J$2,35)=0,\"None\",INDEX(Small_Bridges!$L:$AY,$J$2,35)&\" tons\")","v":{"$error":"#VALUE!"}}]
["Axle Weight Posting:",{"$f":"IF(INDEX(Small_Bridges!$L:$AY,$J$2,34)=0,\"None\",INDEX(Small_Bridges!$L:$AY,$J$2,34)&\" tons\")","v":{"$error":"#VALUE!"}},null,null,"Combination Vehicle Posting:",{"$f":"IF(INDEX(Small_Bridges!$L:$AY,$J$2,36)=0,\"None\",INDEX(Small_Bridges!$L:$AY,$J$2,36)&\" tons\")","v":{"$error":"#VALUE!"}}]
["Load Rating Recommended?",{"$f":"IF(INDEX(Small_Bridges!$L:$AY,$J$2,37)=0,\"None noted\",INDEX(Small_Bridges!$L:$AY,$J$2,37))","v":{"$error":"#VALUE!"}}]
["Inspection Record"]
["Inventory By:",{"$f":"INDEX(Small_Bridges!$L:$AY,$J$2,5)","v":{"$error":"#VALUE!"}}]
["Inventory Date:",{"$f":"INDEX(Small_Bridges!$L:$AY,$J$2,6)","v":{"$error":"#VALUE!"}}]
["Further Inspection Needed?",{"$f":"INDEX(Small_Bridges!$L:$AY,$J$2,38)","v":{"$error":"#VALUE!"}}]

{"sheet":"Small_Bridge_Summary","index":13,"n_rows":4,"n_cols":19,"rows_kept":4,"cut":false,"hidden":false,"merged":[[0,1,0,2],[0,4,0,6],[2,3,3,3],[1,13,3,13],[1,4,3,4],[1,10,3,10],[1,11,3,11],[1,12,3,12],[1,18,23,22],[2,17,3,17],[0,8,0,10],[1,14,1,16],[2,14,2,16],[0,15,0,16]]}
["County:","ALL","Townships:","Townships:","ALL",null,null,"Systems:","ALL",null,null,null,null,null,null,"RAIF-Eligible Structures:",null,{"$f":"COUNTIFS(R2:R1000,\"Yes\")","v":0}]
[null,null,null,null,"Small\nStructure\nNumber",null,null,null,null,null,"Deck\nWidth\n(ft)","Overall\nLength\n(ft)","NBIS\nLength\n(ft)","Overall\nCondition",null,null,null,null,"Small Bridge Summary Worksheet Instructions\n\nClick on the tan Townships and Systems cells to  select the small bridges you want to show in this report. Choose your selections from the pull-down lists that appear:\n\nFor Townships, you may select any individual township in your county that contains small bridges, or ALL to show the small bridges in all townships.\n\nFor Systems, you may select County, County Secondary, Other, or Township. Select ALL to show all small bridges on all systems.\n\nThe Small Bridge Summary will automatically display your choices. If no small bridges fit your chosen criteria, #CALC! errors will display.\n\nYou may print this form to a printer or a Portable Document Format (PDF) file.\n\n The form will print in landscape mode on multiple 8½ x 11 pages, depending on how many small bridges are listed."]
[null,null,null,"Maint-\nenance",null,null,null,null,null,null,null,null,null,"Overall\nCondition","Load Limits (tons)",null,null,"RAIF\nEligible"]
["Township","System","Road",null,null,"Latitude","Longitude","Material","Type","Spans",null,null,null,null,"Axle","Single Unit","Combination"]

{"sheet":"Culvert_Summary","index":14,"n_rows":3,"n_cols":21,"rows_kept":3,"cut":false,"hidden":false,"merged":[[0,17,0,18],[0,4,0,5],[0,8,0,9],[1,4,2,4],[1,5,2,5],[1,6,2,6],[1,7,2,7],[1,16,1,18],[1,19,2,19],[1,20,23,22],[1,11,2,11],[1,12,2,12],[1,13,2,13],[1,14,2,14],[1,15,2,15]]}
["County:","ALL",null,"Townships:","ALL",null,null,"Systems:","ALL",null,null,null,null,null,null,null,null,"RAIF-Eligible Structures:",null,0]
[null,null,null,null,"Maint-\nenance","Small Structure\nNumber","Latitude","Longitude",null,null,null,"Span\n(in)","Rise\n(in)","Outlet\nArea(ft2)","Length\n(ft)","Overall\nCondition","Load Limits (tons)",null,null,"RAIF\nEligible","Culvert Summary Worksheet Instructions\n\nClick on the tan Townships and Systems cells to  select the culverts you want to show in this report. Choose your selections from the pull-down lists that appear:\n\nFor Townships, you may select any individual township in your county that contains culverts, or ALL to show the structures in all townships.\n\nFor Systems, you may select County, County Secondary, Other, or Township. Select ALL to show all culverts on all systems.\n\nThe Culvert Summary will automatically display your choices. If no culverts fit your chosen criteria, #CALC! errors will display.\n\nYou may print this form to a printer or a Portable Document Format (PDF) file.\n\n The form will print landscape on multiple 8½ x 11 pages, depending on how many culverts are listed."]
["Culvert\nGroup","Township","System","Road",null,null,null,null,"Type","Shape","Cells",null,null,null,null,null,"Axle","Single Unit","Combination"]

{"sheet":"Improvement _List_Template","index":15,"n_rows":230,"n_cols":24,"rows_kept":230,"cut":false,"hidden":false,"merged":[[104,0,104,1],[104,2,104,9],[104,10,104,11],[104,12,104,14],[105,0,105,1],[105,2,105,9],[105,10,105,11],[105,12,105,14],[106,0,106,5],[106,6,106,9],[106,10,106,14],[113,0,113,2],[113,3,113,5],[110,3,110,5],[110,6,110,7],[110,8,110,9],[111,3,111,5],[111,6,111,7],[111,8,111,9],[112,3,112,5],[112,6,112,7],[112,8,112,9],[113,6,113,7],[113,8,113,9],[107,0,107,2],[107,3,107,5],[107,6,107,7],[107,8,107,9],[108,0,112,2],[108,3,108,5],[108,6,108,7],[108,8,108,9],[109,3,109,5],[109,6,109,7],[109,8,109,9],[101,0,101,1],[101,2,101,9],[101,10,101,11],[101,12,101,14],[102,0,102,1],[102,2,102,9],[102,10,102,11],[102,12,102,14],[103,0,103,1],[103,2,103,9],[103,10,103,11],[103,12,103,14],[98,0,98,1],[98,2,98,9],[98,10,98,11],[98,12,98,14],[99,0,99,1],[99,2,99,9],[99,10,99,11],[99,12,99,14],[100,0,100,1],[100,2,100,9],[100,10,100,11],[100,12,100,14],[96,0,96,2],[96,3,96,6],[96,7,96,9],[96,10,96,14],[97,0,97,2],[97,3,97,6],[97,7,97,9],[97,10,97,14],[97,18,97,23],[94,0,94,1],[94,2,94,4],[94,5,94,6],[94,7,94,10],[94,11,94,12],[94,13,94,14],[95,0,95,1],[95,2,95,4],[95,5,95,6],[95,7,95,10],[95,11,95,12],[95,13,95,14],[90,0,90,2],[90,3,90,5],[90,6,90,7],[90,8,90,9],[74,18,74,23],[93,0,93,1],[93,3,93,5],[93,11,93,13],[83,0,83,5],[83,6,83,9],[83,10,83,14],[84,0,84,2],[84,3,84,5],[84,6,84,7],[84,8,84,9],[85,0,89,2],[85,3,85,5],[85,6,85,7],[85,8,85,9],[86,3,86,5],[86,6,86,7],[86,8,86,9],[87,3,87,5],[87,6,87,7],[87,8,87,9],[88,3,88,5],[88,6,88,7],[88,8,88,9],[89,3,89,5],[89,6,89,7],[89,8,89,9],[80,0,80,1],[80,2,80,9],[80,10,80,11],[80,12,80,14],[81,0,81,1],[81,2,81,9],[81,10,81,11],[81,12,81,14],[82,0,82,1],[82,2,82,9],[82,10,82,11],[82,12,82,14],[77,0,77,1],[77,2,77,9],[77,10,77,11],[77,12,77,14],[78,0,78,1],[78,2,78,9],[78,10,78,11],[78,12,78,14],[79,0,79,1],[79,2,79,9],[79,10,79,11],[79,12,79,14],[74,0,74,2],[74,3,74,6],[74,7,74,9],[74,10,74,14],[75,0,75,1],[75,2,75,9],[75,10,75,11],[75,12,75,14],[76,0,76,1],[76,2,76,9],[76,10,76,11],[76,12,76,14],[72,0,72,1],[72,2,72,4],[72,5,72,6],[72,7,72,10],[72,11,72,12],[72,13,72,14],[73,0,73,2],[73,3,73,6],[73,7,73,9],[73,10,73,14],[71,0,71,1],[71,2,71,4],[71,5,71,6],[71,7,71,10],[71,11,71,12],[71,13,71,14],[60,0,60,5],[60,6,60,9],[60,10,60,14],[61,0,61,2],[61,3,61,5],[61,6,61,7],[61,8,61,9],[62,0,66,2],[62,3,62,5],[65,6,65,7],[65,8,65,9],[67,0,67,2],[67,3,67,5],[67,6,67,7],[67,8,67,9],[64,3,64,5],[64,6,64,7],[64,8,64,9],[51,18,51,23],[70,0,70,1],[70,3,70,5],[70,11,70,13],[66,3,66,5],[66,6,66,7],[66,8,66,9],[57,0,57,1],[57,2,57,9],[57,10,57,11],[57,12,57,14],[58,0,58,1],[58,2,58,9],[58,10,58,11],[58,12,58,14],[59,0,59,1],[59,2,59,9],[59,10,59,11],[59,12,59,14],[62,6,62,7],[62,8,62,9],[63,3,63,5],[63,6,63,7],[63,8,63,9],[53,0,53,1],[53,2,53,9],[53,10,53,11],[53,12,53,14],[65,3,65,5],[54,0,54,1],[54,2,54,9],[54,10,54,11],[54,12,54,14],[55,0,55,1],[55,2,55,9],[55,10,55,11],[55,12,55,14],[56,0,56,1],[56,2,56,9],[56,10,56,11],[56,12,56,14],[50,0,50,2],[50,3,50,6],[50,7,50,9],[50,10,50,14],[51,0,51,2],[51,3,51,6],[51,7,51,9],[51,10,51,14],[52,0,52,1],[52,2,52,9],[52,10,52,11],[52,12,52,14],[47,11,47,13],[48,0,48,1],[48,2,48,4],[48,5,48,6],[48,7,48,10],[48,11,48,12],[48,13,48,14],[49,0,49,1],[49,2,49,4],[49,5,49,6],[49,7,49,10],[49,11,49,12],[49,13,49,14],[5,7,5,9],[5,10,5,14],[3,0,3,1],[3,2,3,4],[3,5,3,6],[3,7,3,10],[3,11,3,12],[3,13,3,14],[0,1,0,8],[1,0,1,1],[1,3,1,5],[2,0,2,1],[2,2,2,4],[2,5,2,6],[2,7,2,10],[2,11,2,12],[2,13,2,14],[1,11,1,13],[8,0,8,1],[8,2,8,9],[8,10,8,11],[8,12,8,14],[9,0,9,1],[9,2,9,9],[9,10,9,11],[9,12,9,14],[5,18,5,23],[6,0,6,1],[6,2,6,9],[6,10,6,11],[6,12,6,14],[7,0,7,1],[7,2,7,9],[7,10,7,11],[7,12,7,14],[1,17,5,17],[4,0,4,2],[4,3,4,6],[4,7,4,9],[4,10,4,14],[5,0,5,2],[5,3,5,6],[12,0,12,1],[12,2,12,9],[12,10,12,11],[12,12,12,14],[13,0,13,1],[13,2,13,9],[13,10,13,11],[13,12,13,14],[10,0,10,1],[10,2,10,9],[10,10,10,11],[10,12,10,14],[11,0,11,1],[11,2,11,9],[11,10,11,11],[11,12,11,14],[14,0,14,5],[14,6,14,9],[14,10,14,14],[15,0,15,2],[15,3,15,5],[15,6,15,7],[15,8,15,9],[16,0,20,2],[16,3,16,5],[19,3,19,5],[19,6,19,7],[19,8,19,9],[20,3,20,5],[20,6,20,7],[20,8,20,9],[16,6,16,7],[16,8,16,9],[17,3,17,5],[17,6,17,7],[17,8,17,9],[18,3,18,5],[18,6,18,7],[18,8,18,9],[25,0,25,1],[25,2,25,4],[25,5,25,6],[25,7,25,10],[25,11,25,12],[25,13,25,14],[21,0,21,2],[21,3,21,5],[21,6,21,7],[21,8,21,9],[24,0,24,1],[24,3,24,5],[24,11,24,13],[15,10,22,14],[22,0,22,9],[28,18,28,23],[29,0,29,1],[29,2,29,9],[29,10,29,11],[29,12,29,14],[30,0,30,1],[30,2,30,9],[30,10,30,11],[30,12,30,14],[1,16,49,16],[27,0,27,2],[27,3,27,6],[27,7,27,9],[27,10,27,14],[28,0,28,2],[28,3,28,6],[28,7,28,9],[28,10,28,14],[26,0,26,1],[26,2,26,4],[26,5,26,6],[26,7,26,10],[26,11,26,12],[26,13,26,14],[33,0,33,1],[33,2,33,9],[33,10,33,11],[33,12,33,14],[34,0,34,1],[34,2,34,9],[34,10,34,11],[34,12,34,14],[31,0,31,1],[31,2,31,9],[31,10,31,11],[31,12,31,14],[32,0,32,1],[32,2,32,9],[32,10,32,11],[32,12,32,14],[35,0,35,1],[35,2,35,9],[35,10,35,11],[35,12,35,14],[36,0,36,1],[36,2,36,9],[36,10,36,11],[36,12,36,14],[91,0,91,9],[84,10,91,14],[43,3,43,5],[43,6,43,7],[43,8,43,9],[37,10,37,14],[38,0,38,2],[39,6,39,7],[39,8,39,9],[40,3,40,5],[40,6,40,7],[37,0,37,5],[37,6,37,9],[38,3,38,5],[38,6,38,7],[38,8,38,9],[114,0,114,9],[107,10,114,14],[68,0,68,9],[61,10,68,14],[45,0,45,9],[38,10,45,14],[116,0,116,1],[116,3,116,5],[116,11,116,13],[39,0,43,2],[39,3,39,5],[40,8,40,9],[41,3,41,5],[41,6,41,7],[41,8,41,9],[44,0,44,2],[44,3,44,5],[44,6,44,7],[44,8,44,9],[42,3,42,5],[42,6,42,7],[42,8,42,9],[47,0,47,1],[47,3,47,5],[117,0,117,1],[117,2,117,4],[117,5,117,6],[117,7,117,10],[117,11,117,12],[117,13,117,14],[118,0,118,1],[118,2,118,4],[118,5,118,6],[118,7,118,10],[118,11,118,12],[118,13,118,14],[119,0,119,2],[119,3,119,6],[119,7,119,9],[119,10,119,14],[120,0,120,2],[120,3,120,6],[120,7,120,9],[120,10,120,14],[120,18,120,23],[121,0,121,1],[121,2,121,9],[121,10,121,11],[121,12,121,14],[122,0,122,1],[122,2,122,9],[122,10,122,11],[122,12,122,14],[123,0,123,1],[123,2,123,9],[123,10,123,11],[123,12,123,14],[124,0,124,1],[124,2,124,9],[124,10,124,11],[124,12,124,14],[125,0,125,1],[125,2,125,9],[125,10,125,11],[125,12,125,14],[126,0,126,1],[126,2,126,9],[126,10,126,11],[126,12,126,14],[127,0,127,1],[127,2,127,9],[127,10,127,11],[127,12,127,14],[128,0,128,1],[128,2,128,9],[128,10,128,11],[128,12,128,14],[129,0,129,5],[129,6,129,9],[129,10,129,14],[130,0,130,2],[130,3,130,5],[130,6,130,7],[130,8,130,9],[130,10,137,14],[131,0,135,2],[131,3,131,5],[131,6,131,7],[131,8,131,9],[132,3,132,5],[132,6,132,7],[132,8,132,9],[133,3,133,5],[133,6,133,7],[133,8,133,9],[134,3,134,5],[134,6,134,7],[134,8,134,9],[135,3,135,5],[135,6,135,7],[135,8,135,9],[136,0,136,2],[136,3,136,5],[136,6,136,7],[136,8,136,9],[137,0,137,9],[139,0,139,1],[139,3,139,5],[139,11,139,13],[140,0,140,1],[140,2,140,4],[140,5,140,6],[140,7,140,10],[140,11,140,12],[140,13,140,14],[141,0,141,1],[141,2,141,4],[141,5,141,6],[141,7,141,10],[141,11,141,12],[141,13,141,14],[142,0,142,2],[142,3,142,6],[142,7,142,9],[142,10,142,14],[143,0,143,2],[143,3,143,6],[143,7,143,9],[143,10,143,14],[143,18,143,23],[144,0,144,1],[144,2,144,9],[144,10,144,11],[144,12,144,14],[145,0,145,1],[145,2,145,9],[145,10,145,11],[145,12,145,14],[146,0,146,1],[146,2,146,9],[146,10,146,11],[146,12,146,14],[147,0,147,1],[147,2,147,9],[147,10,147,11],[147,12,147,14],[148,0,148,1],[148,2,148,9],[148,10,148,11],[148,12,148,14],[149,0,149,1],[149,2,149,9],[149,10,149,11],[149,12,149,14],[150,0,150,1],[150,2,150,9],[150,10,150,11],[150,12,150,14],[151,0,151,1],[151,2,151,9],[151,10,151,11],[151,12,151,14],[152,0,152,5],[152,6,152,9],[152,10,152,14],[153,0,153,2],[153,3,153,5],[153,6,153,7],[153,8,153,9],[153,10,160,14],[154,0,158,2],[154,3,154,5],[154,6,154,7],[154,8,154,9],[155,3,155,5],[155,6,155,7],[155,8,155,9],[156,3,156,5],[156,6,156,7],[156,8,156,9],[157,3,157,5],[157,6,157,7],[157,8,157,9],[158,3,158,5],[158,6,158,7],[158,8,158,9],[159,0,159,2],[159,3,159,5],[159,6,159,7],[159,8,159,9],[160,0,160,9],[162,0,162,1],[162,3,162,5],[162,11,162,13],[163,0,163,1],[163,2,163,4],[163,5,163,6],[163,7,163,10],[163,11,163,12],[163,13,163,14],[164,0,164,1],[164,2,164,4],[164,5,164,6],[164,7,164,10],[164,11,164,12],[164,13,164,14],[165,0,165,2],[165,3,165,6],[165,7,165,9],[165,10,165,14],[166,0,166,2],[166,3,166,6],[166,7,166,9],[166,10,166,14],[166,18,166,23],[167,0,167,1],[167,2,167,9],[167,10,167,11],[167,12,167,14],[168,0,168,1],[168,2,168,9],[168,10,168,11],[168,12,168,14],[169,0,169,1],[169,2,169,9],[169,10,169,11],[169,12,169,14],[170,0,170,1],[170,2,170,9],[170,10,170,11],[170,12,170,14],[171,0,171,1],[171,2,171,9],[171,10,171,11],[171,12,171,14],[172,0,172,1],[172,2,172,9],[172,10,172,11],[172,12,172,14],[173,0,173,1],[173,2,173,9],[173,10,173,11],[173,12,173,14],[174,0,174,1],[174,2,174,9],[174,10,174,11],[174,12,174,14],[175,0,175,5],[175,6,175,9],[175,10,175,14],[176,0,176,2],[176,3,176,5],[176,6,176,7],[176,8,176,9],[176,10,183,14],[177,0,181,2],[177,3,177,5],[177,6,177,7],[177,8,177,9],[178,3,178,5],[178,6,178,7],[178,8,178,9],[179,3,179,5],[179,6,179,7],[179,8,179,9],[180,3,180,5],[180,6,180,7],[180,8,180,9],[181,3,181,5],[181,6,181,7],[181,8,181,9],[182,0,182,2],[182,3,182,5],[182,6,182,7],[182,8,182,9],[183,0,183,9],[185,0,185,1],[185,3,185,5],[185,11,185,13],[186,0,186,1],[186,2,186,4],[186,5,186,6],[186,7,186,10],[186,11,186,12],[186,13,186,14],[187,0,187,1],[187,2,187,4],[187,5,187,6],[187,7,187,10],[187,11,187,12],[187,13,187,14],[188,0,188,2],[188,3,188,6],[188,7,188,9],[188,10,188,14],[189,0,189,2],[189,3,189,6],[189,7,189,9],[189,10,189,14],[189,18,189,23],[190,0,190,1],[190,2,190,9],[190,10,190,11],[190,12,190,14],[191,0,191,1],[191,2,191,9],[191,10,191,11],[191,12,191,14],[192,0,192,1],[192,2,192,9],[192,10,192,11],[192,12,192,14],[193,0,193,1],[193,2,193,9],[193,10,193,11],[193,12,193,14],[194,0,194,1],[194,2,194,9],[194,10,194,11],[194,12,194,14],[195,0,195,1],[195,2,195,9],[195,10,195,11],[195,12,195,14],[196,0,196,1],[196,2,196,9],[196,10,196,11],[196,12,196,14],[197,0,197,1],[197,2,197,9],[197,10,197,11],[197,12,197,14],[198,0,198,5],[198,6,198,9],[198,10,198,14],[199,0,199,2],[199,3,199,5],[199,6,199,7],[199,8,199,9],[199,10,206,14],[200,0,204,2],[200,3,200,5],[200,6,200,7],[200,8,200,9],[201,3,201,5],[201,6,201,7],[201,8,201,9],[202,3,202,5],[202,6,202,7],[202,8,202,9],[203,3,203,5],[203,6,203,7],[203,8,203,9],[204,3,204,5],[204,6,204,7],[204,8,204,9],[205,0,205,2],[205,3,205,5],[205,6,205,7],[205,8,205,9],[206,0,206,9],[208,0,208,1],[208,3,208,5],[208,11,208,13],[209,0,209,1],[209,2,209,4],[209,5,209,6],[209,7,209,10],[209,11,209,12],[209,13,209,14],[212,10,212,14],[212,18,212,23],[213,0,213,1],[213,2,213,9],[213,10,213,11],[213,12,213,14],[210,0,210,1],[210,2,210,4],[210,5,210,6],[210,7,210,10],[210,11,210,12],[210,13,210,14],[211,0,211,2],[211,3,211,6],[211,7,211,9],[211,10,211,14],[212,0,212,2],[212,3,212,6],[212,7,212,9],[229,0,229,9],[220,0,220,1],[220,2,220,9],[220,10,220,11],[220,12,220,14],[221,0,221,5],[221,6,221,9],[221,10,221,14],[222,0,222,2],[222,3,222,5],[222,6,222,7],[222,8,222,9],[222,10,229,14],[223,0,227,2],[223,3,223,5],[223,6,223,7],[223,8,223,9],[224,3,224,5],[224,6,224,7],[224,8,224,9],[225,3,225,5],[225,6,225,7],[225,8,225,9],[226,3,226,5],[219,0,219,1],[219,2,219,9],[219,10,219,11],[219,12,219,14],[226,8,226,9],[227,3,227,5],[227,6,227,7],[227,8,227,9],[228,0,228,2],[228,3,228,5],[228,6,228,7],[228,8,228,9],[226,6,226,7],[217,0,217,1],[217,2,217,9],[217,10,217,11],[217,12,217,14],[218,0,218,1],[218,2,218,9],[218,10,218,11],[218,12,218,14],[214,10,214,11],[214,12,214,14],[215,0,215,1],[215,2,215,9],[215,10,215,11],[215,12,215,14],[216,0,216,1],[216,2,216,9],[216,10,216,11],[216,12,216,14],[214,0,214,1],[214,2,214,9]]}
[]
["Project #: ",null,1,"Structure Type:",null,null,2,null,null,null,null,"Eligible Structure:",null,null,{"$f":"IF(AND(OR(H4=\"Secondary\",H4=\"Township\"),D5<>\"No Maintenance\",OR(AND(G2=1,SUM(K8:K14)>=16), AND(G2=2,K8<=20))),\"Yes\",\"No\")","v":"No"},null,"Culvert Summary Worksheet Instructions\n\nClick on the tan cells to  select the culverts or bridges you want to show in this report.\n\nFirst, select Culvert or Small Bridge in the top line of the project area. \n\nThen, for culvert projects, enter the Small Structure Numbers of all of the culverts that lie within the group of culverts at the first location in Cells 8-14, in Cells 31-37 for the second location, and so on.\n\nList only one small bridge for each project.  Multiple bridges must be entered into multiple projects.\n\nThe Improvement List Template will fill in each project with information available from the Small Structure Inventory. \n\nFor each project, add the additional information, such as Planned Year, Project Improvement Types, Estimated Cost, Funding Amounts, and Remarks.\n\nThe eligibility of each small structure is evaluated against the criteria stipulated in SDCL §. The road system must be Township or County Secondary; the Mainenance Level must be Full Maintenance; the NBIS length of a small bridge must not exceed 20'; and the Outlet Area of a culvert or group of culverts must be at least 16 square feet.\n\nThis spreadsheet accommodates up to ten (10) projects.\n\nYou may print this form to a printer or a Portable Document Format (PDF) file.\n\n The form will print on multiple 8½ x 11 pages, depending on how many projects are listed. Select only the area you want to print, otherwise all 10 projects will print even if they're not filled in. To set the print area, select the cells you want to print, click on Page Layout, then Print Area, then Set Print Area.\n","Hidden columns S-X are used for calculations","Sheet",{"$f":"G2","v":2}]
["County:",null,{"$f":"IFERROR(INDEX(INDIRECT($S3),$S8,1),\"Not Found\")","v":"Not Found"},null,null,"Road Name:",null,{"$f":"IFERROR(INDEX(INDIRECT($S3),$S8,IF($G2=1,11,10)),\"Not Found\")","v":"Not Found"},null,null,null,"Latitude:",null,{"$f":"IFERROR(INDEX(INDIRECT($S3),$S8,IF($G2=1,8,7)),\"Not Found\")","v":"Not Found"},null,null,null,null,{"$f":"IF(G2=1,\"Culverts!$AI:$CP\",\"Small_Bridges!$L:$AY\")","v":"Small_Bridges!$L:$AY"}]
["Township:",null,{"$f":"IFERROR(INDEX(INDIRECT($S3),$S8,2),\"Not Found\")","v":"Not Found"},null,null,"Road System:",null,{"$f":"IFERROR(INDEX(INDIRECT($S4),$S8,6),\"Not Found\")","v":"Not Found"},null,null,null,"Longitude:",null,{"$f":"IFERROR(INDEX(INDIRECT($S3),$S8,IF($G2=1,9,8)),\"Not Found\")","v":"Not Found"},null,null,null,null,{"$f":"IF(G2=1,\"Culverts!$A:$H\",\"Small_Bridges!$A:$AH\")","v":"Small_Bridges!$A:$AH"}]
["Maintenance Level:",null,null,{"$f":"IFERROR(INDEX(INDIRECT($S3),$S8,IF($G2=1,12,11)),\"Not Found\")","v":"Not Found"},null,null,null,"Number Served:",null,null,{"$f":"IFERROR(INDEX(INDIRECT($S3),$S8,IF($G2=1,14,13)),\"Not Found\")","v":"Not Found"}]
["Road Surface:",null,null,{"$f":"IFERROR(INDEX(INDIRECT($S3),$S8,IF($G2=1,13,12)),\"Not Found\")","v":"Not Found"},null,null,null,"Detour Length:",null,null,{"$f":"IFERROR(INDEX(INDIRECT($S3),$S8,IF($G2=1,15,14))&\" miles\",\"Not Found\")","v":"Not Found"},null,null,null,null,null,null,null,"WORK AREA FOR CULVERT INFORMATION"]
["Small Structures",null,"Structure Description",null,null,null,null,null,null,null,{"$f":"IF(G2=1,\"Outlet (sqft)\",\"NBIS Length (ft)\")","v":"NBIS Length (ft)"},null,"Overall Condition",null,null,null,null,null,"Row","Cells","Span","Rise","Shape","Area"]
["Enter SSNs Here",null,{"$f":"IFERROR(IF($G$2=1,(INDEX(Culverts!$AI:$CP,$S8,20)&\" x \"&INDEX(Culverts!$AI:$CP,$S8,24)&\"\"\"W x \"&INDEX(Culverts!$AI:$CP,$S8,25)&\"\"\"H x \"&INDEX(Culverts!$AI:$CP,$S8,28)&\"’L \"&INDEX(Culverts!$AI:$CP,$S8,21)&\" \"&INDEX(Culverts!$AI:$CP,$S8,23)),(INDEX(Small_Bridges!$L:$BW,$S8,17)&\"'L x \"& INDEX(Small_Bridges!$L:$BW,$S8,21)&\"'W \"& INDEX(Small_Bridges!$L:$BW,$S8,16)&\" \"& INDEX(Small_Bridges!$L:$BW,$S8,15))),\"\")","v":""},null,null,null,null,null,null,null,{"$f":"IF(ISERROR(X8),\"\",IF($G$2=1,X8,INDEX(Small_Bridges!$L:$AW,$S8,18)))","v":""},null,{"$f":"IFERROR(INDEX(INDIRECT($S$3),$S8,IF($G$2=1,51,31)),\"\")","v":""},null,null,null,null,null,{"$f":"IFERROR(IF($G$2=1,MATCH(A8,Culverts!$AR:$AR,0),MATCH(A8,Small_Bridges!$T:$T,0)),\"Not Found\")","v":"Not Found"},{"$f":"INDEX(Culverts!$AI:$CP,$S8,20)","v":{"$error":"#VALUE!"}},{"$f":"INDEX(Culverts!$AI:$CP,$S8,24)","v":{"$error":"#VALUE!"}},{"$f":"INDEX(Culverts!$AI:$CP,$S8,25)","v":{"$error":"#VALUE!"}},{"$f":"INDEX(Culverts!$AI:$CP,$S8,23)","v":{"$error":"#VALUE!"}},{"$f":"VLOOKUP(W8,'Culvert Shapes'!$A$2:$B$9,2,FALSE)*U8*V8","v":{"$error":"#VALUE!"}}]
[null,null,{"$f":"IFERROR(IF($G$2=1,(INDEX(Culverts!$AI:$CP,$S9,20)&\" x \"&INDEX(Culverts!$AI:$CP,$S9,24)&\"\"\"W x \"&INDEX(Culverts!$AI:$CP,$S9,25)&\"\"\"H x \"&INDEX(Culverts!$AI:$CP,$S9,28)&\"’L \"&INDEX(Culverts!$AI:$CP,$S9,21)&\" \"&INDEX(Culverts!$AI:$CP,$S9,23)),(INDEX(Small_Bridges!$L:$BW,$S9,17)&\"'L x \"& INDEX(Small_Bridges!$L:$BW,$S9,21)&\"'W \"& INDEX(Small_Bridges!$L:$BW,$S9,16)&\" \"& INDEX(Small_Bridges!$L:$BW,$S9,15))),\"\")","v":""},null,null,null,null,null,null,null,{"$f":"IF(ISERROR(X9),\"\",IF($G$2=1,X9,INDEX(Small_Bridges!$L:$AW,$S9,18)))","v":""},null,{"$f":"IFERROR(INDEX(INDIRECT($S$3),$S9,IF($G$2=1,51,31)),\"\")","v":""},null,null,null,null,null,{"$f":"IFERROR(IF($G$2=1,MATCH(A9,Culverts!$AR:$AR,0),MATCH(A9,Small_Bridges!$T:$T,0)),\"Not Found\")","v":"Not Found"},{"$f":"INDEX(Culverts!$AI:$CP,$S9,20)","v":{"$error":"#VALUE!"}},{"$f":"INDEX(Culverts!$AI:$CP,$S9,24)","v":{"$error":"#VALUE!"}},{"$f":"INDEX(Culverts!$AI:$CP,$S9,25)","v":{"$error":"#VALUE!"}},{"$f":"INDEX(Culverts!$AI:$CP,$S9,23)","v":{"$error":"#VALUE!"}},{"$f":"VLOOKUP(W9,'Culvert Shapes'!$A$2:$B$9,2,FALSE)*U9*V9","v":{"$error":"#VALUE!"}}]
[null,null,{"$f":"IFERROR(IF($G$2=1,(INDEX(Culverts!$AI:$CP,$S10,20)&\" x \"&INDEX(Culverts!$AI:$CP,$S10,24)&\"\"\"W x \"&INDEX(Culverts!$AI:$CP,$S10,25)&\"\"\"H x \"&INDEX(Culverts!$AI:$CP,$S10,28)&\"’L \"&INDEX(Culverts!$AI:$CP,$S10,21)&\" \"&INDEX(Culverts!$AI:$CP,$S10,23)),(INDEX(Small_Bridges!$L:$BW,$S10,17)&\"'L x \"& INDEX(Small_Bridges!$L:$BW,$S10,21)&\"'W \"& INDEX(Small_Bridges!$L:$BW,$S10,16)&\" \"& INDEX(Small_Bridges!$L:$BW,$S10,15))),\"\")","v":""},null,null,null,null,null,null,null,{"$f":"IF(ISERROR(X10),\"\",IF($G$2=1,X10,INDEX(Small_Bridges!$L:$AW,$S10,18)))","v":""},null,{"$f":"IFERROR(INDEX(INDIRECT($S$3),$S10,IF($G$2=1,51,31)),\"\")","v":""},null,null,null,null,null,{"$f":"IFERROR(IF($G$2=1,MATCH(A10,Culverts!$AR:$AR,0),MATCH(A10,Small_Bridges!$T:$T,0)),\"Not Found\")","v":"Not Found"},{"$f":"INDEX(Culverts!$AI:$CP,$S10,20)","v":{"$error":"#VALUE!"}},{"$f":"INDEX(Culverts!$AI:$CP,$S10,24)","v":{"$error":"#VALUE!"}},{"$f":"INDEX(Culverts!$AI:$CP,$S10,25)","v":{"$error":"#VALUE!"}},{"$f":"INDEX(Culverts!$AI:$CP,$S10,23)","v":{"$error":"#VALUE!"}},{"$f":"VLOOKUP(W10,'Culvert Shapes'!$A$2:$B$9,2,FALSE)*U10*V10","v":{"$error":"#VALUE!"}}]
[null,null,{"$f":"IFERROR(IF($G$2=1,(INDEX(Culverts!$AI:$CP,$S11,20)&\" x \"&INDEX(Culverts!$AI:$CP,$S11,24)&\"\"\"W x \"&INDEX(Culverts!$AI:$CP,$S11,25)&\"\"\"H x \"&INDEX(Culverts!$AI:$CP,$S11,28)&\"’L \"&INDEX(Culverts!$AI:$CP,$S11,21)&\" \"&INDEX(Culverts!$AI:$CP,$S11,23)),(INDEX(Small_Bridges!$L:$BW,$S11,17)&\"'L x \"& INDEX(Small_Bridges!$L:$BW,$S11,21)&\"'W \"& INDEX(Small_Bridges!$L:$BW,$S11,16)&\" \"& INDEX(Small_Bridges!$L:$BW,$S11,15))),\"\")","v":""},null,null,null,null,null,null,null,{"$f":"IF(ISERROR(X11),\"\",IF($G$2=1,X11,INDEX(Small_Bridges!$L:$AW,$S11,18)))","v":""},null,{"$f":"IFERROR(INDEX(INDIRECT($S$3),$S11,IF($G$2=1,51,31)),\"\")","v":""},null,null,null,null,null,{"$f":"IFERROR(IF($G$2=1,MATCH(A11,Culverts!$AR:$AR,0),MATCH(A11,Small_Bridges!$T:$T,0)),\"Not Found\")","v":"Not Found"},{"$f":"INDEX(Culverts!$AI:$CP,$S11,20)","v":{"$error":"#VALUE!"}},{"$f":"INDEX(Culverts!$AI:$CP,$S11,24)","v":{"$error":"#VALUE!"}},{"$f":"INDEX(Culverts!$AI:$CP,$S11,25)","v":{"$error":"#VALUE!"}},{"$f":"INDEX(Culverts!$AI:$CP,$S11,23)","v":{"$error":"#VALUE!"}},{"$f":"VLOOKUP(W11,'Culvert Shapes'!$A$2:$B$9,2,FALSE)*U11*V11","v":{"$error":"#VALUE!"}}]
[null,null,{"$f":"IFERROR(IF($G$2=1,(INDEX(Culverts!$AI:$CP,$S12,20)&\" x \"&INDEX(Culverts!$AI:$CP,$S12,24)&\"\"\"W x \"&INDEX(Culverts!$AI:$CP,$S12,25)&\"\"\"H x \"&INDEX(Culverts!$AI:$CP,$S12,28)&\"’L \"&INDEX(Culverts!$AI:$CP,$S12,21)&\" \"&INDEX(Culverts!$AI:$CP,$S12,23)),(INDEX(Small_Bridges!$L:$BW,$S12,17)&\"'L x \"& INDEX(Small_Bridges!$L:$BW,$S12,21)&\"'W \"& INDEX(Small_Bridges!$L:$BW,$S12,16)&\" \"& INDEX(Small_Bridges!$L:$BW,$S12,15))),\"\")","v":""},null,null,null,null,null,null,null,{"$f":"IF(ISERROR(X12),\"\",IF($G$2=1,X12,INDEX(Small_Bridges!$L:$AW,$S12,18)))","v":""},null,{"$f":"IFERROR(INDEX(INDIRECT($S$3),$S12,IF($G$2=1,51,31)),\"\")","v":""},null,null,null,null,null,{"$f":"IFERROR(IF($G$2=1,MATCH(A12,Culverts!$AR:$AR,0),MATCH(A12,Small_Bridges!$T:$T,0)),\"Not Found\")","v":"Not Found"},{"$f":"INDEX(Culverts!$AI:$CP,$S12,20)","v":{"$error":"#VALUE!"}},{"$f":"INDEX(Culverts!$AI:$CP,$S12,24)","v":{"$error":"#VALUE!"}},{"$f":"INDEX(Culverts!$AI:$CP,$S12,25)","v":{"$error":"#VALUE!"}},{"$f":"INDEX(Culverts!$AI:$CP,$S12,23)","v":{"$error":"#VALUE!"}},{"$f":"VLOOKUP(W12,'Culvert Shapes'!$A$2:$B$9,2,FALSE)*U12*V12","v":{"$error":"#VALUE!"}}]
[null,null,{"$f":"IFERROR(IF($G$2=1,(INDEX(Culverts!$AI:$CP,$S13,20)&\" x \"&INDEX(Culverts!$AI:$CP,$S13,24)&\"\"\"W x \"&INDEX(Culverts!$AI:$CP,$S13,25)&\"\"\"H x \"&INDEX(Culverts!$AI:$CP,$S13,28)&\"’L \"&INDEX(Culverts!$AI:$CP,$S13,21)&\" \"&INDEX(Culverts!$AI:$CP,$S13,23)),(INDEX(Small_Bridges!$L:$BW,$S13,17)&\"'L x \"& INDEX(Small_Bridges!$L:$BW,$S13,21)&\"'W \"& INDEX(Small_Bridges!$L:$BW,$S13,16)&\" \"& INDEX(Small_Bridges!$L:$BW,$S13,15))),\"\")","v":""},null,null,null,null,null,null,null,{"$f":"IF(ISERROR(X13),\"\",IF($G$2=1,X13,INDEX(Small_Bridges!$L:$AW,$S13,18)))","v":""},null,{"$f":"IFERROR(INDEX(INDIRECT($S$3),$S13,IF($G$2=1,51,31)),\"\")","v":""},null,null,null,null,null,{"$f":"IFERROR(IF($G$2=1,MATCH(A13,Culverts!$AR:$AR,0),MATCH(A13,Small_Bridges!$T:$T,0)),\"Not Found\")","v":"Not Found"},{"$f":"INDEX(Culverts!$AI:$CP,$S13,20)","v":{"$error":"#VALUE!"}},{"$f":"INDEX(Culverts!$AI:$CP,$S13,24)","v":{"$error":"#VALUE!"}},{"$f":"INDEX(Culverts!$AI:$CP,$S13,25)","v":{"$error":"#VALUE!"}},{"$f":"INDEX(Culverts!$AI:$CP,$S13,23)","v":{"$error":"#VALUE!"}},{"$f":"VLOOKUP(W13,'Culvert Shapes'!$A$2:$B$9,2,FALSE)*U13*V13","v":{"$error":"#VALUE!"}}]
[null,null,{"$f":"IFERROR(IF($G$2=1,(INDEX(Culverts!$AI:$CP,$S14,20)&\" x \"&INDEX(Culverts!$AI:$CP,$S14,24)&\"\"\"W x \"&INDEX(Culverts!$AI:$CP,$S14,25)&\"\"\"H x \"&INDEX(Culverts!$AI:$CP,$S14,28)&\"’L \"&INDEX(Culverts!$AI:$CP,$S14,21)&\" \"&INDEX(Culverts!$AI:$CP,$S14,23)),(INDEX(Small_Bridges!$L:$BW,$S14,17)&\"'L x \"& INDEX(Small_Bridges!$L:$BW,$S14,21)&\"'W \"& INDEX(Small_Bridges!$L:$BW,$S14,16)&\" \"& INDEX(Small_Bridges!$L:$BW,$S14,15))),\"\")","v":""},null,null,null,null,null,null,null,{"$f":"IF(ISERROR(X14),\"\",IF($G$2=1,X14,INDEX(Small_Bridges!$L:$AW,$S14,18)))","v":""},null,{"$f":"IFERROR(INDEX(INDIRECT($S$3),$S14,IF($G$2=1,51,31)),\"\")","v":""},null,null,null,null,null,{"$f":"IFERROR(IF($G$2=1,MATCH(A14,Culverts!$AR:$AR,0),MATCH(A14,Small_Bridges!$T:$T,0)),\"Not Found\")","v":"Not Found"},{"$f":"INDEX(Culverts!$AI:$CP,$S14,20)","v":{"$error":"#VALUE!"}},{"$f":"INDEX(Culverts!$AI:$CP,$S14,24)","v":{"$error":"#VALUE!"}},{"$f":"INDEX(Culverts!$AI:$CP,$S14,25)","v":{"$error":"#VALUE!"}},{"$f":"INDEX(Culverts!$AI:$CP,$S14,23)","v":{"$error":"#VALUE!"}},{"$f":"VLOOKUP(W14,'Culvert Shapes'!$A$2:$B$9,2,FALSE)*U14*V14","v":{"$error":"#VALUE!"}}]
["Proposed Improvement",null,null,null,null,null,"Anticipated Funding",null,null,null,"Remarks"]
["Planned Year:",null,null,null,null,null,"Federal:"]
["Project\nImprovement\nTypes",null,null,null,null,null,"State:"]
[null,null,null,null,null,null,"County:"]
[null,null,null,null,null,null,"Township:"]
[null,null,null,null,null,null,"Private:"]
[null,null,null,null,null,null,"RAIF Request:"]
["Estimated Cost:","Estimated Cost:",null,null,null,null,"Total:",null,{"$f":"SUM(I16:J21)","v":0}]
["Road owner (township or county) must provide at least 20% of funding."]
[]
["Project #: ",null,{"$f":"C2+1","v":2},"Structure Type:",null,null,1,null,null,null,null,"Eligible Structure:",null,null,{"$f":"IF(AND(OR(H27=\"Secondary\",H27=\"Township\"),D28<>\"No Maintenance\",OR(AND(G25=1,SUM(K31:K37)>=16), AND(G25=2,K31<=20))),\"Yes\",\"No\")","v":"No"},null,null,null,"Sheet",{"$f":"G25","v":1}]
["County:",null,{"$f":"IFERROR(INDEX(INDIRECT($S26),$S31,1),\"Not Found\")","v":"Not Found"},null,null,"Road Name:",null,{"$f":"IFERROR(INDEX(INDIRECT($S26),$S31,IF($G25=1,11,10)),\"Not Found\")","v":"Not Found"},null,null,null,"Latitude:",null,{"$f":"IFERROR(INDEX(INDIRECT($S26),$S31,IF($G25=1,8,7)),\"Not Found\")","v":"Not Found"},null,null,null,null,{"$f":"IF(G25=1,\"Culverts!$AI:$CP\",\"Small_Bridges!$L:$AY\")","v":"Culverts!$AI:$CP"}]
["Township:",null,{"$f":"IFERROR(INDEX(INDIRECT($S26),$S31,2),\"Not Found\")","v":"Not Found"},null,null,"Road System:",null,{"$f":"IFERROR(INDEX(INDIRECT($S27),$S31,6),\"Not Found\")","v":"Not Found"},null,null,null,"Longitude:",null,{"$f":"IFERROR(INDEX(INDIRECT($S26),$S31,IF($G25=1,9,8)),\"Not Found\")","v":"Not Found"},null,null,null,null,{"$f":"IF(G25=1,\"Culverts!$A:$H\",\"Small_Bridges!$A:$AH\")","v":"Culverts!$A:$H"}]
["Maintenance Level:",null,null,{"$f":"IFERROR(INDEX(INDIRECT($S26),$S31,IF($G25=1,12,11)),\"Not Found\")","v":"Not Found"},null,null,null,"Number Served:",null,null,{"$f":"IFERROR(INDEX(INDIRECT($S26),$S31,IF($G25=1,14,13)),\"Not Found\")","v":"Not Found"}]
["Road Surface:",null,null,{"$f":"IFERROR(INDEX(INDIRECT($S26),$S31,IF($G25=1,13,12)),\"Not Found\")","v":"Not Found"},null,null,null,"Detour Length:",null,null,{"$f":"IFERROR(INDEX(INDIRECT($S26),$S31,IF($G25=1,15,14))&\" miles\",\"Not Found\")","v":"Not Found"},null,null,null,null,null,null,null,"WORK AREA FOR CULVERT INFORMATION"]
["Small Structures",null,"Structure Description",null,null,null,null,null,null,null,{"$f":"IF(G25=1,\"Outlet (sqft)\",\"NBIS Length (ft)\")","v":"Outlet (sqft)"},null,"Overall Condition",null,null,null,null,null,"Row","Cells","Span","Rise","Shape","Area"]
["Enter SSNs Here",null,{"$f":"IFERROR(IF($G$25=1,(INDEX(Culverts!$AI:$CP,$S31,20)&\" x \"&INDEX(Culverts!$AI:$CP,$S31,24)&\"\"\"W x \"&INDEX(Culverts!$AI:$CP,$S31,25)&\"\"\"H x \"&INDEX(Culverts!$AI:$CP,$S31,28)&\"’L \"&INDEX(Culverts!$AI:$CP,$S31,21)&\" \"&INDEX(Culverts!$AI:$CP,$S31,23)),(INDEX(Small_Bridges!$L:$BW,$S31,17)&\"'L x \"& INDEX(Small_Bridges!$L:$BW,$S31,21)&\"'W \"& INDEX(Small_Bridges!$L:$BW,$S31,16)&\" \"& INDEX(Small_Bridges!$L:$BW,$S31,15))),\"\")","v":""},null,null,null,null,null,null,null,{"$f":"IF(ISERROR(X31),\"\",IF($G$25=1,X31,INDEX(Small_Bridges!$L:$AW,$S31,18)))","v":""},null,{"$f":"IFERROR(INDEX(INDIRECT($S$26),$S31,IF($G$25=1,51,31)),\"\")","v":""},null,null,null,null,null,{"$f":"IFERROR(IF($G$25=1,MATCH(A31,Culverts!$AR:$AR,0),MATCH(A31,Small_Bridges!$T:$T,0)),\"Not Found\")","v":"Not Found"},{"$f":"INDEX(Culverts!$AI:$CP,$S31,20)","v":{"$error":"#VALUE!"}},{"$f":"INDEX(Culverts!$AI:$CP,$S31,24)","v":{"$error":"#VALUE!"}},{"$f":"INDEX(Culverts!$AI:$CP,$S31,25)","v":{"$error":"#VALUE!"}},{"$f":"INDEX(Culverts!$AI:$CP,$S31,23)","v":{"$error":"#VALUE!"}},{"$f":"VLOOKUP(W31,'Culvert Shapes'!$A$2:$B$9,2,FALSE)*U31*V31","v":{"$error":"#VALUE!"}}]
[null,null,{"$f":"IFERROR(IF($G$25=1,(INDEX(Culverts!$AI:$CP,$S32,20)&\" x \"&INDEX(Culverts!$AI:$CP,$S32,24)&\"\"\"W x \"&INDEX(Culverts!$AI:$CP,$S32,25)&\"\"\"H x \"&INDEX(Culverts!$AI:$CP,$S32,28)&\"’L \"&INDEX(Culverts!$AI:$CP,$S32,21)&\" \"&INDEX(Culverts!$AI:$CP,$S32,23)),(INDEX(Small_Bridges!$L:$BW,$S32,17)&\"'L x \"& INDEX(Small_Bridges!$L:$BW,$S32,21)&\"'W \"& INDEX(Small_Bridges!$L:$BW,$S32,16)&\" \"& INDEX(Small_Bridges!$L:$BW,$S32,15))),\"\")","v":""},null,null,null,null,null,null,null,{"$f":"IF(ISERROR(X32),\"\",IF($G$25=1,X32,INDEX(Small_Bridges!$L:$AW,$S32,18)))","v":""},null,{"$f":"IFERROR(INDEX(INDIRECT($S$26),$S32,IF($G$25=1,51,31)),\"\")","v":""},null,null,null,null,null,{"$f":"IFERROR(IF($G$25=1,MATCH(A32,Culverts!$AR:$AR,0),MATCH(A32,Small_Bridges!$T:$T,0)),\"Not Found\")","v":"Not Found"},{"$f":"INDEX(Culverts!$AI:$CP,$S32,20)","v":{"$error":"#VALUE!"}},{"$f":"INDEX(Culverts!$AI:$CP,$S32,24)","v":{"$error":"#VALUE!"}},{"$f":"INDEX(Culverts!$AI:$CP,$S32,25)","v":{"$error":"#VALUE!"}},{"$f":"INDEX(Culverts!$AI:$CP,$S32,23)","v":{"$error":"#VALUE!"}},{"$f":"VLOOKUP(W32,'Culvert Shapes'!$A$2:$B$9,2,FALSE)*U32*V32","v":{"$error":"#VALUE!"}}]
[null,null,{"$f":"IFERROR(IF($G$25=1,(INDEX(Culverts!$AI:$CP,$S33,20)&\" x \"&INDEX(Culverts!$AI:$CP,$S33,24)&\"\"\"W x \"&INDEX(Culverts!$AI:$CP,$S33,25)&\"\"\"H x \"&INDEX(Culverts!$AI:$CP,$S33,28)&\"’L \"&INDEX(Culverts!$AI:$CP,$S33,21)&\" \"&INDEX(Culverts!$AI:$CP,$S33,23)),(INDEX(Small_Bridges!$L:$BW,$S33,17)&\"'L x \"& INDEX(Small_Bridges!$L:$BW,$S33,21)&\"'W \"& INDEX(Small_Bridges!$L:$BW,$S33,16)&\" \"& INDEX(Small_Bridges!$L:$BW,$S33,15))),\"\")","v":""},null,null,null,null,null,null,null,{"$f":"IF(ISERROR(X33),\"\",IF($G$25=1,X33,INDEX(Small_Bridges!$L:$AW,$S33,18)))","v":""},null,{"$f":"IFERROR(INDEX(INDIRECT($S$26),$S33,IF($G$25=1,51,31)),\"\")","v":""},null,null,null,null,null,{"$f":"IFERROR(IF($G$25=1,MATCH(A33,Culverts!$AR:$AR,0),MATCH(A33,Small_Bridges!$T:$T,0)),\"Not Found\")","v":"Not Found"},{"$f":"INDEX(Culverts!$AI:$CP,$S33,20)","v":{"$error":"#VALUE!"}},{"$f":"INDEX(Culverts!$AI:$CP,$S33,24)","v":{"$error":"#VALUE!"}},{"$f":"INDEX(Culverts!$AI:$CP,$S33,25)","v":{"$error":"#VALUE!"}},{"$f":"INDEX(Culverts!$AI:$CP,$S33,23)","v":{"$error":"#VALUE!"}},{"$f":"VLOOKUP(W33,'Culvert Shapes'!$A$2:$B$9,2,FALSE)*U33*V33","v":{"$error":"#VALUE!"}}]
[null,null,{"$f":"IFERROR(IF($G$25=1,(INDEX(Culverts!$AI:$CP,$S34,20)&\" x \"&INDEX(Culverts!$AI:$CP,$S34,24)&\"\"\"W x \"&INDEX(Culverts!$AI:$CP,$S34,25)&\"\"\"H x \"&INDEX(Culverts!$AI:$CP,$S34,28)&\"’L \"&INDEX(Culverts!$AI:$CP,$S34,21)&\" \"&INDEX(Culverts!$AI:$CP,$S34,23)),(INDEX(Small_Bridges!$L:$BW,$S34,17)&\"'L x \"& INDEX(Small_Bridges!$L:$BW,$S34,21)&\"'W \"& INDEX(Small_Bridges!$L:$BW,$S34,16)&\" \"& INDEX(Small_Bridges!$L:$BW,$S34,15))),\"\")","v":""},null,null,null,null,null,null,null,{"$f":"IF(ISERROR(X34),\"\",IF($G$25=1,X34,INDEX(Small_Bridges!$L:$AW,$S34,18)))","v":""},null,{"$f":"IFERROR(INDEX(INDIRECT($S$26),$S34,IF($G$25=1,51,31)),\"\")","v":""},null,null,null,null,null,{"$f":"IFERROR(IF($G$25=1,MATCH(A34,Culverts!$AR:$AR,0),MATCH(A34,Small_Bridges!$T:$T,0)),\"Not Found\")","v":"Not Found"},{"$f":"INDEX(Culverts!$AI:$CP,$S34,20)","v":{"$error":"#VALUE!"}},{"$f":"INDEX(Culverts!$AI:$CP,$S34,24)","v":{"$error":"#VALUE!"}},{"$f":"INDEX(Culverts!$AI:$CP,$S34,25)","v":{"$error":"#VALUE!"}},{"$f":"INDEX(Culverts!$AI:$CP,$S34,23)","v":{"$error":"#VALUE!"}},{"$f":"VLOOKUP(W34,'Culvert Shapes'!$A$2:$B$9,2,FALSE)*U34*V34","v":{"$error":"#VALUE!"}}]
[null,null,{"$f":"IFERROR(IF($G$25=1,(INDEX(Culverts!$AI:$CP,$S35,20)&\" x \"&INDEX(Culverts!$AI:$CP,$S35,24)&\"\"\"W x \"&INDEX(Culverts!$AI:$CP,$S35,25)&\"\"\"H x \"&INDEX(Culverts!$AI:$CP,$S35,28)&\"’L \"&INDEX(Culverts!$AI:$CP,$S35,21)&\" \"&INDEX(Culverts!$AI:$CP,$S35,23)),(INDEX(Small_Bridges!$L:$BW,$S35,17)&\"'L x \"& INDEX(Small_Bridges!$L:$BW,$S35,21)&\"'W \"& INDEX(Small_Bridges!$L:$BW,$S35,16)&\" \"& INDEX(Small_Bridges!$L:$BW,$S35,15))),\"\")","v":""},null,null,null,null,null,null,null,{"$f":"IF(ISERROR(X35),\"\",IF($G$25=1,X35,INDEX(Small_Bridges!$L:$AW,$S35,18)))","v":""},null,{"$f":"IFERROR(INDEX(INDIRECT($S$26),$S35,IF($G$25=1,51,31)),\"\")","v":""},null,null,null,null,null,{"$f":"IFERROR(IF($G$25=1,MATCH(A35,Culverts!$AR:$AR,0),MATCH(A35,Small_Bridges!$T:$T,0)),\"Not Found\")","v":"Not Found"},{"$f":"INDEX(Culverts!$AI:$CP,$S35,20)","v":{"$error":"#VALUE!"}},{"$f":"INDEX(Culverts!$AI:$CP,$S35,24)","v":{"$error":"#VALUE!"}},{"$f":"INDEX(Culverts!$AI:$CP,$S35,25)","v":{"$error":"#VALUE!"}},{"$f":"INDEX(Culverts!$AI:$CP,$S35,23)","v":{"$error":"#VALUE!"}},{"$f":"VLOOKUP(W35,'Culvert Shapes'!$A$2:$B$9,2,FALSE)*U35*V35","v":{"$error":"#VALUE!"}}]
[null,null,{"$f":"IFERROR(IF($G$25=1,(INDEX(Culverts!$AI:$CP,$S36,20)&\" x \"&INDEX(Culverts!$AI:$CP,$S36,24)&\"\"\"W x \"&INDEX(Culverts!$AI:$CP,$S36,25)&\"\"\"H x \"&INDEX(Culverts!$AI:$CP,$S36,28)&\"’L \"&INDEX(Culverts!$AI:$CP,$S36,21)&\" \"&INDEX(Culverts!$AI:$CP,$S36,23)),(INDEX(Small_Bridges!$L:$BW,$S36,17)&\"'L x \"& INDEX(Small_Bridges!$L:$BW,$S36,21)&\"'W \"& INDEX(Small_Bridges!$L:$BW,$S36,16)&\" \"& INDEX(Small_Bridges!$L:$BW,$S36,15))),\"\")","v":""},null,null,null,null,null,null,null,{"$f":"IF(ISERROR(X36),\"\",IF($G$25=1,X36,INDEX(Small_Bridges!$L:$AW,$S36,18)))","v":""},null,{"$f":"IFERROR(INDEX(INDIRECT($S$26),$S36,IF($G$25=1,51,31)),\"\")","v":""},null,null,null,null,null,{"$f":"IFERROR(IF($G$25=1,MATCH(A36,Culverts!$AR:$AR,0),MATCH(A36,Small_Bridges!$T:$T,0)),\"Not Found\")","v":"Not Found"},{"$f":"INDEX(Culverts!$AI:$CP,$S36,20)","v":{"$error":"#VALUE!"}},{"$f":"INDEX(Culverts!$AI:$CP,$S36,24)","v":{"$error":"#VALUE!"}},{"$f":"INDEX(Culverts!$AI:$CP,$S36,25)","v":{"$error":"#VALUE!"}},{"$f":"INDEX(Culverts!$AI:$CP,$S36,23)","v":{"$error":"#VALUE!"}},{"$f":"VLOOKUP(W36,'Culvert Shapes'!$A$2:$B$9,2,FALSE)*U36*V36","v":{"$error":"#VALUE!"}}]
[null,null,{"$f":"IFERROR(IF($G$25=1,(INDEX(Culverts!$AI:$CP,$S37,20)&\" x \"&INDEX(Culverts!$AI:$CP,$S37,24)&\"\"\"W x \"&INDEX(Culverts!$AI:$CP,$S37,25)&\"\"\"H x \"&INDEX(Culverts!$AI:$CP,$S37,28)&\"’L \"&INDEX(Culverts!$AI:$CP,$S37,21)&\" \"&INDEX(Culverts!$AI:$CP,$S37,23)),(INDEX(Small_Bridges!$L:$BW,$S37,17)&\"'L x \"& INDEX(Small_Bridges!$L:$BW,$S37,21)&\"'W \"& INDEX(Small_Bridges!$L:$BW,$S37,16)&\" \"& INDEX(Small_Bridges!$L:$BW,$S37,15))),\"\")","v":""},null,null,null,null,null,null,null,{"$f":"IF(ISERROR(X37),\"\",IF($G$25=1,X37,INDEX(Small_Bridges!$L:$AW,$S37,18)))","v":""},null,{"$f":"IFERROR(INDEX(INDIRECT($S$26),$S37,IF($G$25=1,51,31)),\"\")","v":""},null,null,null,null,null,{"$f":"IFERROR(IF($G$25=1,MATCH(A37,Culverts!$AR:$AR,0),MATCH(A37,Small_Bridges!$T:$T,0)),\"Not Found\")","v":"Not Found"},{"$f":"INDEX(Culverts!$AI:$CP,$S37,20)","v":{"$error":"#VALUE!"}},{"$f":"INDEX(Culverts!$AI:$CP,$S37,24)","v":{"$error":"#VALUE!"}},{"$f":"INDEX(Culverts!$AI:$CP,$S37,25)","v":{"$error":"#VALUE!"}},{"$f":"INDEX(Culverts!$AI:$CP,$S37,23)","v":{"$error":"#VALUE!"}},{"$f":"VLOOKUP(W37,'Culvert Shapes'!$A$2:$B$9,2,FALSE)*U37*V37","v":{"$error":"#VALUE!"}}]
["Proposed Improvement",null,null,null,null,null,"Anticipated Funding",null,null,null,"Remarks"]
["Planned Year:",null,null,null,null,null,"Federal:"]
["Project\nImprovement\nTypes",null,null,null,null,null,"State:"]
[null,null,null,null,null,null,"County:"]
[null,null,null,null,null,null,"Township:"]
[null,null,null,null,null,null,"Private:"]
[null,null,null,null,null,null,"RAIF Request:"]
["Estimated Cost:","Estimated Cost:",null,null,null,null,"Total:",null,{"$f":"SUM(I39:J44)","v":0}]
["Road owner (township or county) must provide at least 20% of funding."]
[]
["Project #: ",null,{"$f":"C25+1","v":3},"Structure Type:",null,null,1,null,null,null,null,"Eligible Structure:",null,null,{"$f":"IF(AND(OR(H50=\"Secondary\",H50=\"Township\"),D51<>\"No Maintenance\",OR(AND(G48=1,SUM(K54:K60)>=16), AND(G48=2,K54<=20))),\"Yes\",\"No\")","v":"No"},null,null,null,"Sheet",{"$f":"G48","v":1}]
["County:",null,{"$f":"IFERROR(INDEX(INDIRECT($S49),$S54,1),\"Not Found\")","v":"Not Found"},null,null,"Road Name:",null,null,null,null,null,"Latitude:",null,{"$f":"IFERROR(INDEX(INDIRECT($S49),$S54,IF($G48=1,8,7)),\"Not Found\")","v":"Not Found"},null,null,null,null,{"$f":"IF(G48=1,\"Culverts!$AI:$CP\",\"Small_Bridges!$L:$AY\")","v":"Culverts!$AI:$CP"}]
["Township:",null,{"$f":"IFERROR(INDEX(INDIRECT($S49),$S54,2),\"Not Found\")","v":"Not Found"},null,null,"Road System:",null,{"$f":"IFERROR(INDEX(INDIRECT($S50),$S54,6),\"Not Found\")","v":"Not Found"},null,null,null,"Longitude:",null,{"$f":"IFERROR(INDEX(INDIRECT($S49),$S54,IF($G48=1,9,8)),\"Not Found\")","v":"Not Found"},null,null,null,null,{"$f":"IF(G48=1,\"Culverts!$A:$H\",\"Small_Bridges!$A:$AH\")","v":"Culverts!$A:$H"}]
["Maintenance Level:",null,null,{"$f":"IFERROR(INDEX(INDIRECT($S49),$S54,IF($G48=1,12,11)),\"Not Found\")","v":"Not Found"},null,null,null,"Number Served:",null,null,{"$f":"IFERROR(INDEX(INDIRECT($S49),$S54,IF($G48=1,14,13)),\"Not Found\")","v":"Not Found"}]
["Road Surface:",null,null,{"$f":"IFERROR(INDEX(INDIRECT($S49),$S54,IF($G48=1,13,12)),\"Not Found\")","v":"Not Found"},null,null,null,"Detour Length:",null,null,{"$f":"IFERROR(INDEX(INDIRECT($S49),$S54,IF($G48=1,15,14))&\" miles\",\"Not Found\")","v":"Not Found"},null,null,null,null,null,null,null,"WORK AREA FOR CULVERT INFORMATION"]
["Small Structures",null,"Structure Description",null,null,null,null,null,null,null,{"$f":"IF(T$48=1,\"Outlet (sqft)\",\"NBIS Length (ft)\")","v":"Outlet (sqft)"},null,"Overall Condition",null,null,null,null,null,"Row","Cells","Span","Rise","Shape","Area"]
["Enter SSNs Here",null,{"$f":"IFERROR(IF($G$48=1,(INDEX(Culverts!$AI:$CP,$S54,20)&\" x \"&INDEX(Culverts!$AI:$CP,$S54,24)&\"\"\"W x \"&INDEX(Culverts!$AI:$CP,$S54,25)&\"\"\"H x \"&INDEX(Culverts!$AI:$CP,$S54,28)&\"’L \"&INDEX(Culverts!$AI:$CP,$S54,21)&\" \"&INDEX(Culverts!$AI:$CP,$S54,23)),(INDEX(Small_Bridges!$L:$BW,$S54,17)&\"'L x \"& INDEX(Small_Bridges!$L:$BW,$S54,21)&\"'W \"& INDEX(Small_Bridges!$L:$BW,$S54,16)&\" \"& INDEX(Small_Bridges!$L:$BW,$S54,15))),\"\")","v":""},null,null,null,null,null,null,null,{"$f":"IF(ISERROR(X54),\"\",IF($G$48=1,X54,INDEX(Small_Bridges!$L:$AW,$S54,18)))","v":""},null,{"$f":"IFERROR(INDEX(INDIRECT($S$26),$S54,IF($G$48=1,51,31)),\"\")","v":""},null,null,null,null,null,{"$f":"IFERROR(IF($G$48=1,MATCH(A54,Culverts!$AR:$AR,0),MATCH(A54,Small_Bridges!$T:$T,0)),\"Not Found\")","v":"Not Found"},{"$f":"INDEX(Culverts!$AI:$CP,$S54,20)","v":{"$error":"#VALUE!"}},{"$f":"INDEX(Culverts!$AI:$CP,$S54,24)","v":{"$error":"#VALUE!"}},{"$f":"INDEX(Culverts!$AI:$CP,$S54,25)","v":{"$error":"#VALUE!"}},{"$f":"INDEX(Culverts!$AI:$CP,$S54,23)","v":{"$error":"#VALUE!"}},{"$f":"VLOOKUP(W54,'Culvert Shapes'!$A$2:$B$9,2,FALSE)*U54*V54","v":{"$error":"#VALUE!"}}]
[null,null,{"$f":"IFERROR(IF($G$48=1,(INDEX(Culverts!$AI:$CP,$S55,20)&\" x \"&INDEX(Culverts!$AI:$CP,$S55,24)&\"\"\"W x \"&INDEX(Culverts!$AI:$CP,$S55,25)&\"\"\"H x \"&INDEX(Culverts!$AI:$CP,$S55,28)&\"’L \"&INDEX(Culverts!$AI:$CP,$S55,21)&\" \"&INDEX(Culverts!$AI:$CP,$S55,23)),(INDEX(Small_Bridges!$L:$BW,$S55,17)&\"'L x \"& INDEX(Small_Bridges!$L:$BW,$S55,21)&\"'W \"& INDEX(Small_Bridges!$L:$BW,$S55,16)&\" \"& INDEX(Small_Bridges!$L:$BW,$S55,15))),\"\")","v":""},null,null,null,null,null,null,null,{"$f":"IF(ISERROR(X55),\"\",IF($G$48=1,X55,INDEX(Small_Bridges!$L:$AW,$S55,18)))","v":""},null,{"$f":"IFERROR(INDEX(INDIRECT($S$26),$S55,IF($G$48=1,51,31)),\"\")","v":""},null,null,null,null,null,{"$f":"IFERROR(IF($G$48=1,MATCH(A55,Culverts!$AR:$AR,0),MATCH(A55,Small_Bridges!$T:$T,0)),\"Not Found\")","v":"Not Found"},{"$f":"INDEX(Culverts!$AI:$CP,$S55,20)","v":{"$error":"#VALUE!"}},{"$f":"INDEX(Culverts!$AI:$CP,$S55,24)","v":{"$error":"#VALUE!"}},{"$f":"INDEX(Culverts!$AI:$CP,$S55,25)","v":{"$error":"#VALUE!"}},{"$f":"INDEX(Culverts!$AI:$CP,$S55,23)","v":{"$error":"#VALUE!"}},{"$f":"VLOOKUP(W55,'Culvert Shapes'!$A$2:$B$9,2,FALSE)*U55*V55","v":{"$error":"#VALUE!"}}]
[null,null,{"$f":"IFERROR(IF($G$48=1,(INDEX(Culverts!$AI:$CP,$S56,20)&\" x \"&INDEX(Culverts!$AI:$CP,$S56,24)&\"\"\"W x \"&INDEX(Culverts!$AI:$CP,$S56,25)&\"\"\"H x \"&INDEX(Culverts!$AI:$CP,$S56,28)&\"’L \"&INDEX(Culverts!$AI:$CP,$S56,21)&\" \"&INDEX(Culverts!$AI:$CP,$S56,23)),(INDEX(Small_Bridges!$L:$BW,$S56,17)&\"'L x \"& INDEX(Small_Bridges!$L:$BW,$S56,21)&\"'W \"& INDEX(Small_Bridges!$L:$BW,$S56,16)&\" \"& INDEX(Small_Bridges!$L:$BW,$S56,15))),\"\")","v":""},null,null,null,null,null,null,null,{"$f":"IF(ISERROR(X56),\"\",IF($G$48=1,X56,INDEX(Small_Bridges!$L:$AW,$S56,18)))","v":""},null,{"$f":"IFERROR(INDEX(INDIRECT($S$26),$S56,IF($G$48=1,51,31)),\"\")","v":""},null,null,null,null,null,{"$f":"IFERROR(IF($G$48=1,MATCH(A56,Culverts!$AR:$AR,0),MATCH(A56,Small_Bridges!$T:$T,0)),\"Not Found\")","v":"Not Found"},{"$f":"INDEX(Culverts!$AI:$CP,$S56,20)","v":{"$error":"#VALUE!"}},{"$f":"INDEX(Culverts!$AI:$CP,$S56,24)","v":{"$error":"#VALUE!"}},{"$f":"INDEX(Culverts!$AI:$CP,$S56,25)","v":{"$error":"#VALUE!"}},{"$f":"INDEX(Culverts!$AI:$CP,$S56,23)","v":{"$error":"#VALUE!"}},{"$f":"VLOOKUP(W56,'Culvert Shapes'!$A$2:$B$9,2,FALSE)*U56*V56","v":{"$error":"#VALUE!"}}]
[null,null,{"$f":"IFERROR(IF($G$48=1,(INDEX(Culverts!$AI:$CP,$S57,20)&\" x \"&INDEX(Culverts!$AI:$CP,$S57,24)&\"\"\"W x \"&INDEX(Culverts!$AI:$CP,$S57,25)&\"\"\"H x \"&INDEX(Culverts!$AI:$CP,$S57,28)&\"’L \"&INDEX(Culverts!$AI:$CP,$S57,21)&\" \"&INDEX(Culverts!$AI:$CP,$S57,23)),(INDEX(Small_Bridges!$L:$BW,$S57,17)&\"'L x \"& INDEX(Small_Bridges!$L:$BW,$S57,21)&\"'W \"& INDEX(Small_Bridges!$L:$BW,$S57,16)&\" \"& INDEX(Small_Bridges!$L:$BW,$S57,15))),\"\")","v":""},null,null,null,null,null,null,null,{"$f":"IF(ISERROR(X57),\"\",IF($G$48=1,X57,INDEX(Small_Bridges!$L:$AW,$S57,18)))","v":""},null,{"$f":"IFERROR(INDEX(INDIRECT($S$26),$S57,IF($G$48=1,51,31)),\"\")","v":""},null,null,null,null,null,{"$f":"IFERROR(IF($G$48=1,MATCH(A57,Culverts!$AR:$AR,0),MATCH(A57,Small_Bridges!$T:$T,0)),\"Not Found\")","v":"Not Found"},{"$f":"INDEX(Culverts!$AI:$CP,$S57,20)","v":{"$error":"#VALUE!"}},{"$f":"INDEX(Culverts!$AI:$CP,$S57,24)","v":{"$error":"#VALUE!"}},{"$f":"INDEX(Culverts!$AI:$CP,$S57,25)","v":{"$error":"#VALUE!"}},{"$f":"INDEX(Culverts!$AI:$CP,$S57,23)","v":{"$error":"#VALUE!"}},{"$f":"VLOOKUP(W57,'Culvert Shapes'!$A$2:$B$9,2,FALSE)*U57*V57","v":{"$error":"#VALUE!"}}]
[null,null,{"$f":"IFERROR(IF($G$48=1,(INDEX(Culverts!$AI:$CP,$S58,20)&\" x \"&INDEX(Culverts!$AI:$CP,$S58,24)&\"\"\"W x \"&INDEX(Culverts!$AI:$CP,$S58,25)&\"\"\"H x \"&INDEX(Culverts!$AI:$CP,$S58,28)&\"’L \"&INDEX(Culverts!$AI:$CP,$S58,21)&\" \"&INDEX(Culverts!$AI:$CP,$S58,23)),(INDEX(Small_Bridges!$L:$BW,$S58,17)&\"'L x \"& INDEX(Small_Bridges!$L:$BW,$S58,21)&\"'W \"& INDEX(Small_Bridges!$L:$BW,$S58,16)&\" \"& INDEX(Small_Bridges!$L:$BW,$S58,15))),\"\")","v":""},null,null,null,null,null,null,null,{"$f":"IF(ISERROR(X58),\"\",IF($G$48=1,X58,INDEX(Small_Bridges!$L:$AW,$S58,18)))","v":""},null,{"$f":"IFERROR(INDEX(INDIRECT($S$26),$S58,IF($G$48=1,51,31)),\"\")","v":""},null,null,null,null,null,{"$f":"IFERROR(IF($G$48=1,MATCH(A58,Culverts!$AR:$AR,0),MATCH(A58,Small_Bridges!$T:$T,0)),\"Not Found\")","v":"Not Found"},{"$f":"INDEX(Culverts!$AI:$CP,$S58,20)","v":{"$error":"#VALUE!"}},{"$f":"INDEX(Culverts!$AI:$CP,$S58,24)","v":{"$error":"#VALUE!"}},{"$f":"INDEX(Culverts!$AI:$CP,$S58,25)","v":{"$error":"#VALUE!"}},{"$f":"INDEX(Culverts!$AI:$CP,$S58,23)","v":{"$error":"#VALUE!"}},{"$f":"VLOOKUP(W58,'Culvert Shapes'!$A$2:$B$9,2,FALSE)*U58*V58","v":{"$error":"#VALUE!"}}]
[null,null,{"$f":"IFERROR(IF($G$48=1,(INDEX(Culverts!$AI:$CP,$S59,20)&\" x \"&INDEX(Culverts!$AI:$CP,$S59,24)&\"\"\"W x \"&INDEX(Culverts!$AI:$CP,$S59,25)&\"\"\"H x \"&INDEX(Culverts!$AI:$CP,$S59,28)&\"’L \"&INDEX(Culverts!$AI:$CP,$S59,21)&\" \"&INDEX(Culverts!$AI:$CP,$S59,23)),(INDEX(Small_Bridges!$L:$BW,$S59,17)&\"'L x \"& INDEX(Small_Bridges!$L:$BW,$S59,21)&\"'W \"& INDEX(Small_Bridges!$L:$BW,$S59,16)&\" \"& INDEX(Small_Bridges!$L:$BW,$S59,15))),\"\")","v":""},null,null,null,null,null,null,null,{"$f":"IF(ISERROR(X59),\"\",IF($G$48=1,X59,INDEX(Small_Bridges!$L:$AW,$S59,18)))","v":""},null,{"$f":"IFERROR(INDEX(INDIRECT($S$26),$S59,IF($G$48=1,51,31)),\"\")","v":""},null,null,null,null,null,{"$f":"IFERROR(IF($G$48=1,MATCH(A59,Culverts!$AR:$AR,0),MATCH(A59,Small_Bridges!$T:$T,0)),\"Not Found\")","v":"Not Found"},{"$f":"INDEX(Culverts!$AI:$CP,$S59,20)","v":{"$error":"#VALUE!"}},{"$f":"INDEX(Culverts!$AI:$CP,$S59,24)","v":{"$error":"#VALUE!"}},{"$f":"INDEX(Culverts!$AI:$CP,$S59,25)","v":{"$error":"#VALUE!"}},{"$f":"INDEX(Culverts!$AI:$CP,$S59,23)","v":{"$error":"#VALUE!"}},{"$f":"VLOOKUP(W59,'Culvert Shapes'!$A$2:$B$9,2,FALSE)*U59*V59","v":{"$error":"#VALUE!"}}]
[null,null,{"$f":"IFERROR(IF($G$48=1,(INDEX(Culverts!$AI:$CP,$S60,20)&\" x \"&INDEX(Culverts!$AI:$CP,$S60,24)&\"\"\"W x \"&INDEX(Culverts!$AI:$CP,$S60,25)&\"\"\"H x \"&INDEX(Culverts!$AI:$CP,$S60,28)&\"’L \"&INDEX(Culverts!$AI:$CP,$S60,21)&\" \"&INDEX(Culverts!$AI:$CP,$S60,23)),(INDEX(Small_Bridges!$L:$BW,$S60,17)&\"'L x \"& INDEX(Small_Bridges!$L:$BW,$S60,21)&\"'W \"& INDEX(Small_Bridges!$L:$BW,$S60,16)&\" \"& INDEX(Small_Bridges!$L:$BW,$S60,15))),\"\")","v":""},null,null,null,null,null,null,null,{"$f":"IF(ISERROR(X60),\"\",IF($G$48=1,X60,INDEX(Small_Bridges!$L:$AW,$S60,18)))","v":""},null,{"$f":"IFERROR(INDEX(INDIRECT($S$26),$S60,IF($G$48=1,51,31)),\"\")","v":""},null,null,null,null,null,{"$f":"IFERROR(IF($G$48=1,MATCH(A60,Culverts!$AR:$AR,0),MATCH(A60,Small_Bridges!$T:$T,0)),\"Not Found\")","v":"Not Found"},{"$f":"INDEX(Culverts!$AI:$CP,$S60,20)","v":{"$error":"#VALUE!"}},{"$f":"INDEX(Culverts!$AI:$CP,$S60,24)","v":{"$error":"#VALUE!"}},{"$f":"INDEX(Culverts!$AI:$CP,$S60,25)","v":{"$error":"#VALUE!"}},{"$f":"INDEX(Culverts!$AI:$CP,$S60,23)","v":{"$error":"#VALUE!"}},{"$f":"VLOOKUP(W60,'Culvert Shapes'!$A$2:$B$9,2,FALSE)*U60*V60","v":{"$error":"#VALUE!"}}]
["Proposed Improvement",null,null,null,null,null,"Anticipated Funding",null,null,null,"Remarks"]
["Planned Year:",null,null,null,null,null,"Federal:",null,0]
["Project\nImprovement\nTypes",null,null,null,null,null,"State:",null,0]
[null,null,null,null,null,null,"County:",null,0]
[null,null,null,null,null,null,"Township:",null,0]
[null,null,null,null,null,null,"Private:",null,0]
[null,null,null,null,null,null,"RAIF Request:",null,0]
["Estimated Cost:","Estimated Cost:",null,null,null,null,"Total:",null,{"$f":"SUM(I62:J67)","v":0}]
["Road owner (township or county) must provide at least 20% of funding."]
[]
["Project #: ",null,{"$f":"C48+1","v":4},"Structure Type:",null,null,2,null,null,null,null,"Eligible Structure:",null,null,{"$f":"IF(AND(OR(H73=\"Secondary\",H73=\"Township\"),D74<>\"No Maintenance\",OR(AND(G71=1,SUM(K77:K83)>=16), AND(G71=2,K77<=20))),\"Yes\",\"No\")","v":"No"},null,null,null,"Sheet",{"$f":"G71","v":2}]
["County:",null,{"$f":"IFERROR(INDEX(INDIRECT($S72),$S77,1),\"Not Found\")","v":"Not Found"},null,null,"Road Name:",null,{"$f":"IFERROR(INDEX(INDIRECT($S72),$S77,IF($G71=1,11,10)),\"Not Found\")","v":"Not Found"},null,null,null,"Latitude:",null,{"$f":"IFERROR(INDEX(INDIRECT($S72),$S77,IF($G71=1,8,7)),\"Not Found\")","v":"Not Found"},null,null,null,null,{"$f":"IF(G71=1,\"Culverts!$AI:$CP\",\"Small_Bridges!$L:$AY\")","v":"Small_Bridges!$L:$AY"}]
["Township:",null,{"$f":"IFERROR(INDEX(INDIRECT($S72),$S77,2),\"Not Found\")","v":"Not Found"},null,null,"Road System:",null,{"$f":"IFERROR(INDEX(INDIRECT($S73),$S77,6),\"Not Found\")","v":"Not Found"},null,null,null,"Longitude:",null,{"$f":"IFERROR(INDEX(INDIRECT($S72),$S77,IF($G71=1,9,8)),\"Not Found\")","v":"Not Found"},null,null,null,null,{"$f":"IF(G71=1,\"Culverts!$A:$H\",\"Small_Bridges!$A:$AH\")","v":"Small_Bridges!$A:$AH"}]
["Maintenance Level:",null,null,{"$f":"IFERROR(INDEX(INDIRECT($S72),$S77,IF($G71=1,12,11)),\"Not Found\")","v":"Not Found"},null,null,null,"Number Served:",null,null,{"$f":"IFERROR(INDEX(INDIRECT($S72),$S77,IF($G71=1,14,13)),\"Not Found\")","v":"Not Found"}]
["Road Surface:",null,null,{"$f":"IFERROR(INDEX(INDIRECT($S72),$S77,IF($G71=1,13,12)),\"Not Found\")","v":"Not Found"},null,null,null,"Detour Length:",null,null,{"$f":"IFERROR(INDEX(INDIRECT($S72),$S77,IF($G71=1,15,14))&\" miles\",\"Not Found\")","v":"Not Found"},null,null,null,null,null,null,null,"WORK AREA FOR CULVERT INFORMATION"]
["Small Structures",null,"Structure Description",null,null,null,null,null,null,null,{"$f":"IF(G71=1,\"Outlet (sqft)\",\"NBIS Length (ft)\")","v":"NBIS Length (ft)"},null,"Overall Condition",null,null,null,null,null,"Row","Cells","Span","Rise","Shape","Area"]
["Enter SSNs Here",null,{"$f":"IFERROR(IF($G$71=1,(INDEX(Culverts!$AI:$CP,$S77,20)&\" x \"&INDEX(Culverts!$AI:$CP,$S77,24)&\"\"\"W x \"&INDEX(Culverts!$AI:$CP,$S77,25)&\"\"\"H x \"&INDEX(Culverts!$AI:$CP,$S77,28)&\"’L \"&INDEX(Culverts!$AI:$CP,$S77,21)&\" \"&INDEX(Culverts!$AI:$CP,$S77,23)),(INDEX(Small_Bridges!$L:$BW,$S77,17)&\"'L x \"& INDEX(Small_Bridges!$L:$BW,$S77,21)&\"'W \"& INDEX(Small_Bridges!$L:$BW,$S77,16)&\" \"& INDEX(Small_Bridges!$L:$BW,$S77,15))),\"\")","v":""},null,null,null,null,null,null,null,{"$f":"IF(ISERROR(X77),\"\",IF($G$71=1,X77,INDEX(Small_Bridges!$L:$AW,$S77,18)))","v":""},null,{"$f":"IFERROR(INDEX(INDIRECT($S$26),$S77,IF($G$71=1,51,31)),\"\")","v":""},null,null,null,null,null,{"$f":"IFERROR(IF($G$71=1,MATCH(A77,Culverts!$AR:$AR,0),MATCH(A77,Small_Bridges!$T:$T,0)),\"Not Found\")","v":"Not Found"},{"$f":"INDEX(Culverts!$AI:$CP,$S77,20)","v":{"$error":"#VALUE!"}},{"$f":"INDEX(Culverts!$AI:$CP,$S77,24)","v":{"$error":"#VALUE!"}},{"$f":"INDEX(Culverts!$AI:$CP,$S77,25)","v":{"$error":"#VALUE!"}},{"$f":"INDEX(Culverts!$AI:$CP,$S77,23)","v":{"$error":"#VALUE!"}},{"$f":"VLOOKUP(W77,'Culvert Shapes'!$A$2:$B$9,2,FALSE)*U77*V77","v":{"$error":"#VALUE!"}}]
[null,null,{"$f":"IFERROR(IF($G$71=1,(INDEX(Culverts!$AI:$CP,$S78,20)&\" x \"&INDEX(Culverts!$AI:$CP,$S78,24)&\"\"\"W x \"&INDEX(Culverts!$AI:$CP,$S78,25)&\"\"\"H x \"&INDEX(Culverts!$AI:$CP,$S78,28)&\"’L \"&INDEX(Culverts!$AI:$CP,$S78,21)&\" \"&INDEX(Culverts!$AI:$CP,$S78,23)),(INDEX(Small_Bridges!$L:$BW,$S78,17)&\"'L x \"& INDEX(Small_Bridges!$L:$BW,$S78,21)&\"'W \"& INDEX(Small_Bridges!$L:$BW,$S78,16)&\" \"& INDEX(Small_Bridges!$L:$BW,$S78,15))),\"\")","v":""},null,null,null,null,null,null,null,{"$f":"IF(ISERROR(X78),\"\",IF($G$71=1,X78,INDEX(Small_Bridges!$L:$AW,$S78,18)))","v":""},null,{"$f":"IFERROR(INDEX(INDIRECT($S$26),$S78,IF($G$71=1,51,31)),\"\")","v":""},null,null,null,null,null,{"$f":"IFERROR(IF($G$71=1,MATCH(A78,Culverts!$AR:$AR,0),MATCH(A78,Small_Bridges!$T:$T,0)),\"Not Found\")","v":"Not Found"},{"$f":"INDEX(Culverts!$AI:$CP,$S78,20)","v":{"$error":"#VALUE!"}},{"$f":"INDEX(Culverts!$AI:$CP,$S78,24)","v":{"$error":"#VALUE!"}},{"$f":"INDEX(Culverts!$AI:$CP,$S78,25)","v":{"$error":"#VALUE!"}},{"$f":"INDEX(Culverts!$AI:$CP,$S78,23)","v":{"$error":"#VALUE!"}},{"$f":"VLOOKUP(W78,'Culvert Shapes'!$A$2:$B$9,2,FALSE)*U78*V78","v":{"$error":"#VALUE!"}}]
[null,null,{"$f":"IFERROR(IF($G$71=1,(INDEX(Culverts!$AI:$CP,$S79,20)&\" x \"&INDEX(Culverts!$AI:$CP,$S79,24)&\"\"\"W x \"&INDEX(Culverts!$AI:$CP,$S79,25)&\"\"\"H x \"&INDEX(Culverts!$AI:$CP,$S79,28)&\"’L \"&INDEX(Culverts!$AI:$CP,$S79,21)&\" \"&INDEX(Culverts!$AI:$CP,$S79,23)),(INDEX(Small_Bridges!$L:$BW,$S79,17)&\"'L x \"& INDEX(Small_Bridges!$L:$BW,$S79,21)&\"'W \"& INDEX(Small_Bridges!$L:$BW,$S79,16)&\" \"& INDEX(Small_Bridges!$L:$BW,$S79,15))),\"\")","v":""},null,null,null,null,null,null,null,{"$f":"IF(ISERROR(X79),\"\",IF($G$71=1,X79,INDEX(Small_Bridges!$L:$AW,$S79,18)))","v":""},null,{"$f":"IFERROR(INDEX(INDIRECT($S$26),$S79,IF($G$71=1,51,31)),\"\")","v":""},null,null,null,null,null,{"$f":"IFERROR(IF($G$71=1,MATCH(A79,Culverts!$AR:$AR,0),MATCH(A79,Small_Bridges!$T:$T,0)),\"Not Found\")","v":"Not Found"},{"$f":"INDEX(Culverts!$AI:$CP,$S79,20)","v":{"$error":"#VALUE!"}},{"$f":"INDEX(Culverts!$AI:$CP,$S79,24)","v":{"$error":"#VALUE!"}},{"$f":"INDEX(Culverts!$AI:$CP,$S79,25)","v":{"$error":"#VALUE!"}},{"$f":"INDEX(Culverts!$AI:$CP,$S79,23)","v":{"$error":"#VALUE!"}},{"$f":"VLOOKUP(W79,'Culvert Shapes'!$A$2:$B$9,2,FALSE)*U79*V79","v":{"$error":"#VALUE!"}}]
[null,null,{"$f":"IFERROR(IF($G$71=1,(INDEX(Culverts!$AI:$CP,$S80,20)&\" x \"&INDEX(Culverts!$AI:$CP,$S80,24)&\"\"\"W x \"&INDEX(Culverts!$AI:$CP,$S80,25)&\"\"\"H x \"&INDEX(Culverts!$AI:$CP,$S80,28)&\"’L \"&INDEX(Culverts!$AI:$CP,$S80,21)&\" \"&INDEX(Culverts!$AI:$CP,$S80,23)),(INDEX(Small_Bridges!$L:$BW,$S80,17)&\"'L x \"& INDEX(Small_Bridges!$L:$BW,$S80,21)&\"'W \"& INDEX(Small_Bridges!$L:$BW,$S80,16)&\" \"& INDEX(Small_Bridges!$L:$BW,$S80,15))),\"\")","v":""},null,null,null,null,null,null,null,{"$f":"IF(ISERROR(X80),\"\",IF($G$71=1,X80,INDEX(Small_Bridges!$L:$AW,$S80,18)))","v":""},null,{"$f":"IFERROR(INDEX(INDIRECT($S$26),$S80,IF($G$71=1,51,31)),\"\")","v":""},null,null,null,null,null,{"$f":"IFERROR(IF($G$71=1,MATCH(A80,Culverts!$AR:$AR,0),MATCH(A80,Small_Bridges!$T:$T,0)),\"Not Found\")","v":"Not Found"},{"$f":"INDEX(Culverts!$AI:$CP,$S80,20)","v":{"$error":"#VALUE!"}},{"$f":"INDEX(Culverts!$AI:$CP,$S80,24)","v":{"$error":"#VALUE!"}},{"$f":"INDEX(Culverts!$AI:$CP,$S80,25)","v":{"$error":"#VALUE!"}},{"$f":"INDEX(Culverts!$AI:$CP,$S80,23)","v":{"$error":"#VALUE!"}},{"$f":"VLOOKUP(W80,'Culvert Shapes'!$A$2:$B$9,2,FALSE)*U80*V80","v":{"$error":"#VALUE!"}}]
[null,null,{"$f":"IFERROR(IF($G$71=1,(INDEX(Culverts!$AI:$CP,$S81,20)&\" x \"&INDEX(Culverts!$AI:$CP,$S81,24)&\"\"\"W x \"&INDEX(Culverts!$AI:$CP,$S81,25)&\"\"\"H x \"&INDEX(Culverts!$AI:$CP,$S81,28)&\"’L \"&INDEX(Culverts!$AI:$CP,$S81,21)&\" \"&INDEX(Culverts!$AI:$CP,$S81,23)),(INDEX(Small_Bridges!$L:$BW,$S81,17)&\"'L x \"& INDEX(Small_Bridges!$L:$BW,$S81,21)&\"'W \"& INDEX(Small_Bridges!$L:$BW,$S81,16)&\" \"& INDEX(Small_Bridges!$L:$BW,$S81,15))),\"\")","v":""},null,null,null,null,null,null,null,{"$f":"IF(ISERROR(X81),\"\",IF($G$71=1,X81,INDEX(Small_Bridges!$L:$AW,$S81,18)))","v":""},null,{"$f":"IFERROR(INDEX(INDIRECT($S$26),$S81,IF($G$71=1,51,31)),\"\")","v":""},null,null,null,null,null,{"$f":"IFERROR(IF($G$71=1,MATCH(A81,Culverts!$AR:$AR,0),MATCH(A81,Small_Bridges!$T:$T,0)),\"Not Found\")","v":"Not Found"},{"$f":"INDEX(Culverts!$AI:$CP,$S81,20)","v":{"$error":"#VALUE!"}},{"$f":"INDEX(Culverts!$AI:$CP,$S81,24)","v":{"$error":"#VALUE!"}},{"$f":"INDEX(Culverts!$AI:$CP,$S81,25)","v":{"$error":"#VALUE!"}},{"$f":"INDEX(Culverts!$AI:$CP,$S81,23)","v":{"$error":"#VALUE!"}},{"$f":"VLOOKUP(W81,'Culvert Shapes'!$A$2:$B$9,2,FALSE)*U81*V81","v":{"$error":"#VALUE!"}}]
[null,null,{"$f":"IFERROR(IF($G$71=1,(INDEX(Culverts!$AI:$CP,$S82,20)&\" x \"&INDEX(Culverts!$AI:$CP,$S82,24)&\"\"\"W x \"&INDEX(Culverts!$AI:$CP,$S82,25)&\"\"\"H x \"&INDEX(Culverts!$AI:$CP,$S82,28)&\"’L \"&INDEX(Culverts!$AI:$CP,$S82,21)&\" \"&INDEX(Culverts!$AI:$CP,$S82,23)),(INDEX(Small_Bridges!$L:$BW,$S82,17)&\"'L x \"& INDEX(Small_Bridges!$L:$BW,$S82,21)&\"'W \"& INDEX(Small_Bridges!$L:$BW,$S82,16)&\" \"& INDEX(Small_Bridges!$L:$BW,$S82,15))),\"\")","v":""},null,null,null,null,null,null,null,{"$f":"IF(ISERROR(X82),\"\",IF($G$71=1,X82,INDEX(Small_Bridges!$L:$AW,$S82,18)))","v":""},null,{"$f":"IFERROR(INDEX(INDIRECT($S$26),$S82,IF($G$71=1,51,31)),\"\")","v":""},null,null,null,null,null,{"$f":"IFERROR(IF($G$71=1,MATCH(A82,Culverts!$AR:$AR,0),MATCH(A82,Small_Bridges!$T:$T,0)),\"Not Found\")","v":"Not Found"},{"$f":"INDEX(Culverts!$AI:$CP,$S82,20)","v":{"$error":"#VALUE!"}},{"$f":"INDEX(Culverts!$AI:$CP,$S82,24)","v":{"$error":"#VALUE!"}},{"$f":"INDEX(Culverts!$AI:$CP,$S82,25)","v":{"$error":"#VALUE!"}},{"$f":"INDEX(Culverts!$AI:$CP,$S82,23)","v":{"$error":"#VALUE!"}},{"$f":"VLOOKUP(W82,'Culvert Shapes'!$A$2:$B$9,2,FALSE)*U82*V82","v":{"$error":"#VALUE!"}}]
[null,null,{"$f":"IFERROR(IF($G$71=1,(INDEX(Culverts!$AI:$CP,$S83,20)&\" x \"&INDEX(Culverts!$AI:$CP,$S83,24)&\"\"\"W x \"&INDEX(Culverts!$AI:$CP,$S83,25)&\"\"\"H x \"&INDEX(Culverts!$AI:$CP,$S83,28)&\"’L \"&INDEX(Culverts!$AI:$CP,$S83,21)&\" \"&INDEX(Culverts!$AI:$CP,$S83,23)),(INDEX(Small_Bridges!$L:$BW,$S83,17)&\"'L x \"& INDEX(Small_Bridges!$L:$BW,$S83,21)&\"'W \"& INDEX(Small_Bridges!$L:$BW,$S83,16)&\" \"& INDEX(Small_Bridges!$L:$BW,$S83,15))),\"\")","v":""},null,null,null,null,null,null,null,{"$f":"IF(ISERROR(X83),\"\",IF($G$71=1,X83,INDEX(Small_Bridges!$L:$AW,$S83,18)))","v":""},null,{"$f":"IFERROR(INDEX(INDIRECT($S$26),$S83,IF($G$71=1,51,31)),\"\")","v":""},null,null,null,null,null,{"$f":"IFERROR(IF($G$71=1,MATCH(A83,Culverts!$AR:$AR,0),MATCH(A83,Small_Bridges!$T:$T,0)),\"Not Found\")","v":"Not Found"},{"$f":"INDEX(Culverts!$AI:$CP,$S83,20)","v":{"$error":"#VALUE!"}},{"$f":"INDEX(Culverts!$AI:$CP,$S83,24)","v":{"$error":"#VALUE!"}},{"$f":"INDEX(Culverts!$AI:$CP,$S83,25)","v":{"$error":"#VALUE!"}},{"$f":"INDEX(Culverts!$AI:$CP,$S83,23)","v":{"$error":"#VALUE!"}},{"$f":"VLOOKUP(W83,'Culvert Shapes'!$A$2:$B$9,2,FALSE)*U83*V83","v":{"$error":"#VALUE!"}}]
["Proposed Improvement",null,null,null,null,null,"Anticipated Funding",null,null,null,"Remarks"]
["Planned Year:",null,null,null,null,null,"Federal:",null,0]
["Project\nImprovement\nTypes",null,null,null,null,null,"State:",null,0]
[null,null,null,null,null,null,"County:",null,0]
[null,null,null,null,null,null,"Township:",null,0]
[null,null,null,null,null,null,"Private:",null,0]
[null,null,null,null,null,null,"RAIF Request:",null,0]
["Estimated Cost:","Estimated Cost:",null,10000,null,null,"Total:",null,{"$f":"SUM(I85:J90)","v":0}]
["Road owner (township or county) must provide at least 20% of funding."]
[]
["Project #: ",null,{"$f":"C71+1","v":5},"Structure Type:",null,null,2,null,null,null,null,"Eligible Structure:",null,null,{"$f":"IF(AND(OR(H96=\"Secondary\",H96=\"Township\"),D97<>\"No Maintenance\",OR(AND(G94=1,SUM(K100:K106)>=16), AND(G94=2,K100<=20))),\"Yes\",\"No\")","v":"No"},null,{"$f":"G94","v":2},null,"Sheet",{"$f":"G94","v":2}]
["County:",null,{"$f":"IFERROR(INDEX(INDIRECT($S95),$S100,1),\"Not Found\")","v":"Not Found"},null,null,"Road Name:",null,{"$f":"IFERROR(INDEX(INDIRECT($S95),$S100,IF($G94=1,11,10)),\"Not Found\")","v":"Not Found"},null,null,null,"Latitude:",null,{"$f":"IFERROR(INDEX(INDIRECT($S95),$S100,IF($G94=1,8,7)),\"Not Found\")","v":"Not Found"},null,null,null,null,{"$f":"IF(G94=1,\"Culverts!$AI:$CP\",\"Small_Bridges!$L:$AY\")","v":"Small_Bridges!$L:$AY"}]
["Township:",null,{"$f":"IFERROR(INDEX(INDIRECT($S95),$S100,2),\"Not Found\")","v":"Not Found"},null,null,"Road System:",null,{"$f":"IFERROR(INDEX(INDIRECT($S96),$S100,6),\"Not Found\")","v":"Not Found"},null,null,null,"Longitude:",null,{"$f":"IFERROR(INDEX(INDIRECT($S95),$S100,IF($G94=1,9,8)),\"Not Found\")","v":"Not Found"},null,null,null,null,{"$f":"IF(G94=1,\"Culverts!$A:$H\",\"Small_Bridges!$A:$AH\")","v":"Small_Bridges!$A:$AH"}]
["Maintenance Level:",null,null,{"$f":"IFERROR(INDEX(INDIRECT($S95),$S100,IF($G94=1,12,11)),\"Not Found\")","v":"Not Found"},null,null,null,"Number Served:",null,null,{"$f":"IFERROR(INDEX(INDIRECT($S95),$S100,IF($G94=1,14,13)),\"Not Found\")","v":"Not Found"}]
["Road Surface:",null,null,{"$f":"IFERROR(INDEX(INDIRECT($S95),$S100,IF($G94=1,13,12)),\"Not Found\")","v":"Not Found"},null,null,null,"Detour Length:",null,null,{"$f":"IFERROR(INDEX(INDIRECT($S95),$S100,IF($G94=1,15,14))&\" miles\",\"Not Found\")","v":"Not Found"},null,null,null,null,null,null,null,"WORK AREA FOR CULVERT INFORMATION"]
["Small Structures",null,"Structure Description",null,null,null,null,null,null,null,{"$f":"IF(G94=1,\"Outlet (sqft)\",\"NBIS Length (ft)\")","v":"NBIS Length (ft)"},null,"Overall Condition",null,null,null,null,null,"Row","Cells","Span","Rise","Shape","Area"]
["Enter SSNs Here",null,{"$f":"IFERROR(IF($G$94=1,(INDEX(Culverts!$AI:$CP,$S100,20)&\" x \"&INDEX(Culverts!$AI:$CP,$S100,24)&\"\"\"W x \"&INDEX(Culverts!$AI:$CP,$S100,25)&\"\"\"H x \"&INDEX(Culverts!$AI:$CP,$S100,28)&\"’L \"&INDEX(Culverts!$AI:$CP,$S100,21)&\" \"&INDEX(Culverts!$AI:$CP,$S100,23)),(INDEX(Small_Bridges!$L:$BW,$S100,17)&\"'L x \"& INDEX(Small_Bridges!$L:$BW,$S100,21)&\"'W \"& INDEX(Small_Bridges!$L:$BW,$S100,16)&\" \"& INDEX(Small_Bridges!$L:$BW,$S100,15))),\"\")","v":""},null,null,null,null,null,null,null,{"$f":"IF(ISERROR(X100),\"\",IF($G$94=1,X100,INDEX(Small_Bridges!$L:$AW,$S100,18)))","v":""},null,{"$f":"IFERROR(INDEX(INDIRECT($S$72),$S100,IF($G$94=1,51,31)),\"\")","v":""},null,null,null,null,null,{"$f":"IFERROR(IF($G$94=1,MATCH(A100,Culverts!$AR:$AR,0),MATCH(A100,Small_Bridges!$T:$T,0)),\"Not Found\")","v":"Not Found"},{"$f":"INDEX(Culverts!$AI:$CP,$S100,20)","v":{"$error":"#VALUE!"}},{"$f":"INDEX(Culverts!$AI:$CP,$S100,24)","v":{"$error":"#VALUE!"}},{"$f":"INDEX(Culverts!$AI:$CP,$S100,25)","v":{"$error":"#VALUE!"}},{"$f":"INDEX(Culverts!$AI:$CP,$S100,23)","v":{"$error":"#VALUE!"}},{"$f":"VLOOKUP(W100,'Culvert Shapes'!$A$2:$B$9,2,FALSE)*U100*V100","v":{"$error":"#VALUE!"}}]
[null,null,{"$f":"IFERROR(IF($G$94=1,(INDEX(Culverts!$AI:$CP,$S101,20)&\" x \"&INDEX(Culverts!$AI:$CP,$S101,24)&\"\"\"W x \"&INDEX(Culverts!$AI:$CP,$S101,25)&\"\"\"H x \"&INDEX(Culverts!$AI:$CP,$S101,28)&\"’L \"&INDEX(Culverts!$AI:$CP,$S101,21)&\" \"&INDEX(Culverts!$AI:$CP,$S101,23)),(INDEX(Small_Bridges!$L:$BW,$S101,17)&\"'L x \"& INDEX(Small_Bridges!$L:$BW,$S101,21)&\"'W \"& INDEX(Small_Bridges!$L:$BW,$S101,16)&\" \"& INDEX(Small_Bridges!$L:$BW,$S101,15))),\"\")","v":""},null,null,null,null,null,null,null,{"$f":"IF(ISERROR(X101),\"\",IF($G$94=1,X101,INDEX(Small_Bridges!$L:$AW,$S101,18)))","v":""},null,{"$f":"IFERROR(INDEX(INDIRECT($S$72),$S101,IF($G$94=1,51,31)),\"\")","v":""},null,null,null,null,null,{"$f":"IFERROR(IF($G$94=1,MATCH(A101,Culverts!$AR:$AR,0),MATCH(A101,Small_Bridges!$T:$T,0)),\"Not Found\")","v":"Not Found"},{"$f":"INDEX(Culverts!$AI:$CP,$S101,20)","v":{"$error":"#VALUE!"}},{"$f":"INDEX(Culverts!$AI:$CP,$S101,24)","v":{"$error":"#VALUE!"}},{"$f":"INDEX(Culverts!$AI:$CP,$S101,25)","v":{"$error":"#VALUE!"}},{"$f":"INDEX(Culverts!$AI:$CP,$S101,23)","v":{"$error":"#VALUE!"}},{"$f":"VLOOKUP(W101,'Culvert Shapes'!$A$2:$B$9,2,FALSE)*U101*V101","v":{"$error":"#VALUE!"}}]
[null,null,{"$f":"IFERROR(IF($G$94=1,(INDEX(Culverts!$AI:$CP,$S102,20)&\" x \"&INDEX(Culverts!$AI:$CP,$S102,24)&\"\"\"W x \"&INDEX(Culverts!$AI:$CP,$S102,25)&\"\"\"H x \"&INDEX(Culverts!$AI:$CP,$S102,28)&\"’L \"&INDEX(Culverts!$AI:$CP,$S102,21)&\" \"&INDEX(Culverts!$AI:$CP,$S102,23)),(INDEX(Small_Bridges!$L:$BW,$S102,17)&\"'L x \"& INDEX(Small_Bridges!$L:$BW,$S102,21)&\"'W \"& INDEX(Small_Bridges!$L:$BW,$S102,16)&\" \"& INDEX(Small_Bridges!$L:$BW,$S102,15))),\"\")","v":""},null,null,null,null,null,null,null,{"$f":"IF(ISERROR(X102),\"\",IF($G$94=1,X102,INDEX(Small_Bridges!$L:$AW,$S102,18)))","v":""},null,{"$f":"IFERROR(INDEX(INDIRECT($S$72),$S102,IF($G$94=1,51,31)),\"\")","v":""},null,null,null,null,null,{"$f":"IFERROR(IF($G$94=1,MATCH(A102,Culverts!$AR:$AR,0),MATCH(A102,Small_Bridges!$T:$T,0)),\"Not Found\")","v":"Not Found"},{"$f":"INDEX(Culverts!$AI:$CP,$S102,20)","v":{"$error":"#VALUE!"}},{"$f":"INDEX(Culverts!$AI:$CP,$S102,24)","v":{"$error":"#VALUE!"}},{"$f":"INDEX(Culverts!$AI:$CP,$S102,25)","v":{"$error":"#VALUE!"}},{"$f":"INDEX(Culverts!$AI:$CP,$S102,23)","v":{"$error":"#VALUE!"}},{"$f":"VLOOKUP(W102,'Culvert Shapes'!$A$2:$B$9,2,FALSE)*U102*V102","v":{"$error":"#VALUE!"}}]
[null,null,{"$f":"IFERROR(IF($G$94=1,(INDEX(Culverts!$AI:$CP,$S103,20)&\" x \"&INDEX(Culverts!$AI:$CP,$S103,24)&\"\"\"W x \"&INDEX(Culverts!$AI:$CP,$S103,25)&\"\"\"H x \"&INDEX(Culverts!$AI:$CP,$S103,28)&\"’L \"&INDEX(Culverts!$AI:$CP,$S103,21)&\" \"&INDEX(Culverts!$AI:$CP,$S103,23)),(INDEX(Small_Bridges!$L:$BW,$S103,17)&\"'L x \"& INDEX(Small_Bridges!$L:$BW,$S103,21)&\"'W \"& INDEX(Small_Bridges!$L:$BW,$S103,16)&\" \"& INDEX(Small_Bridges!$L:$BW,$S103,15))),\"\")","v":""},null,null,null,null,null,null,null,{"$f":"IF(ISERROR(X103),\"\",IF($G$94=1,X103,INDEX(Small_Bridges!$L:$AW,$S103,18)))","v":""},null,{"$f":"IFERROR(INDEX(INDIRECT($S$72),$S103,IF($G$94=1,51,31)),\"\")","v":""},null,null,null,null,null,{"$f":"IFERROR(IF($G$94=1,MATCH(A103,Culverts!$AR:$AR,0),MATCH(A103,Small_Bridges!$T:$T,0)),\"Not Found\")","v":"Not Found"},{"$f":"INDEX(Culverts!$AI:$CP,$S103,20)","v":{"$error":"#VALUE!"}},{"$f":"INDEX(Culverts!$AI:$CP,$S103,24)","v":{"$error":"#VALUE!"}},{"$f":"INDEX(Culverts!$AI:$CP,$S103,25)","v":{"$error":"#VALUE!"}},{"$f":"INDEX(Culverts!$AI:$CP,$S103,23)","v":{"$error":"#VALUE!"}},{"$f":"VLOOKUP(W103,'Culvert Shapes'!$A$2:$B$9,2,FALSE)*U103*V103","v":{"$error":"#VALUE!"}}]
[null,null,{"$f":"IFERROR(IF($G$94=1,(INDEX(Culverts!$AI:$CP,$S104,20)&\" x \"&INDEX(Culverts!$AI:$CP,$S104,24)&\"\"\"W x \"&INDEX(Culverts!$AI:$CP,$S104,25)&\"\"\"H x \"&INDEX(Culverts!$AI:$CP,$S104,28)&\"’L \"&INDEX(Culverts!$AI:$CP,$S104,21)&\" \"&INDEX(Culverts!$AI:$CP,$S104,23)),(INDEX(Small_Bridges!$L:$BW,$S104,17)&\"'L x \"& INDEX(Small_Bridges!$L:$BW,$S104,21)&\"'W \"& INDEX(Small_Bridges!$L:$BW,$S104,16)&\" \"& INDEX(Small_Bridges!$L:$BW,$S104,15))),\"\")","v":""},null,null,null,null,null,null,null,{"$f":"IF(ISERROR(X104),\"\",IF($G$94=1,X104,INDEX(Small_Bridges!$L:$AW,$S104,18)))","v":""},null,{"$f":"IFERROR(INDEX(INDIRECT($S$72),$S104,IF($G$94=1,51,31)),\"\")","v":""},null,null,null,null,null,{"$f":"IFERROR(IF($G$94=1,MATCH(A104,Culverts!$AR:$AR,0),MATCH(A104,Small_Bridges!$T:$T,0)),\"Not Found\")","v":"Not Found"},{"$f":"INDEX(Culverts!$AI:$CP,$S104,20)","v":{"$error":"#VALUE!"}},{"$f":"INDEX(Culverts!$AI:$CP,$S104,24)","v":{"$error":"#VALUE!"}},{"$f":"INDEX(Culverts!$AI:$CP,$S104,25)","v":{"$error":"#VALUE!"}},{"$f":"INDEX(Culverts!$AI:$CP,$S104,23)","v":{"$error":"#VALUE!"}},{"$f":"VLOOKUP(W104,'Culvert Shapes'!$A$2:$B$9,2,FALSE)*U104*V104","v":{"$error":"#VALUE!"}}]
[null,null,{"$f":"IFERROR(IF($G$94=1,(INDEX(Culverts!$AI:$CP,$S105,20)&\" x \"&INDEX(Culverts!$AI:$CP,$S105,24)&\"\"\"W x \"&INDEX(Culverts!$AI:$CP,$S105,25)&\"\"\"H x \"&INDEX(Culverts!$AI:$CP,$S105,28)&\"’L \"&INDEX(Culverts!$AI:$CP,$S105,21)&\" \"&INDEX(Culverts!$AI:$CP,$S105,23)),(INDEX(Small_Bridges!$L:$BW,$S105,17)&\"'L x \"& INDEX(Small_Bridges!$L:$BW,$S105,21)&\"'W \"& INDEX(Small_Bridges!$L:$BW,$S105,16)&\" \"& INDEX(Small_Bridges!$L:$BW,$S105,15))),\"\")","v":""},null,null,null,null,null,null,null,{"$f":"IF(ISERROR(X105),\"\",IF($G$94=1,X105,INDEX(Small_Bridges!$L:$AW,$S105,18)))","v":""},null,{"$f":"IFERROR(INDEX(INDIRECT($S$72),$S105,IF($G$94=1,51,31)),\"\")","v":""},null,null,null,null,null,{"$f":"IFERROR(IF($G$94=1,MATCH(A105,Culverts!$AR:$AR,0),MATCH(A105,Small_Bridges!$T:$T,0)),\"Not Found\")","v":"Not Found"},{"$f":"INDEX(Culverts!$AI:$CP,$S105,20)","v":{"$error":"#VALUE!"}},{"$f":"INDEX(Culverts!$AI:$CP,$S105,24)","v":{"$error":"#VALUE!"}},{"$f":"INDEX(Culverts!$AI:$CP,$S105,25)","v":{"$error":"#VALUE!"}},{"$f":"INDEX(Culverts!$AI:$CP,$S105,23)","v":{"$error":"#VALUE!"}},{"$f":"VLOOKUP(W105,'Culvert Shapes'!$A$2:$B$9,2,FALSE)*U105*V105","v":{"$error":"#VALUE!"}}]
[null,null,{"$f":"IFERROR(IF($G$94=1,(INDEX(Culverts!$AI:$CP,$S106,20)&\" x \"&INDEX(Culverts!$AI:$CP,$S106,24)&\"\"\"W x \"&INDEX(Culverts!$AI:$CP,$S106,25)&\"\"\"H x \"&INDEX(Culverts!$AI:$CP,$S106,28)&\"’L \"&INDEX(Culverts!$AI:$CP,$S106,21)&\" \"&INDEX(Culverts!$AI:$CP,$S106,23)),(INDEX(Small_Bridges!$L:$BW,$S106,17)&\"'L x \"& INDEX(Small_Bridges!$L:$BW,$S106,21)&\"'W \"& INDEX(Small_Bridges!$L:$BW,$S106,16)&\" \"& INDEX(Small_Bridges!$L:$BW,$S106,15))),\"\")","v":""},null,null,null,null,null,null,null,{"$f":"IF(ISERROR(X106),\"\",IF($G$94=1,X106,INDEX(Small_Bridges!$L:$AW,$S106,18)))","v":""},null,{"$f":"IFERROR(INDEX(INDIRECT($S$72),$S106,IF($G$94=1,51,31)),\"\")","v":""},null,null,null,null,null,{"$f":"IFERROR(IF($G$94=1,MATCH(A106,Culverts!$AR:$AR,0),MATCH(A106,Small_Bridges!$T:$T,0)),\"Not Found\")","v":"Not Found"},{"$f":"INDEX(Culverts!$AI:$CP,$S106,20)","v":{"$error":"#VALUE!"}},{"$f":"INDEX(Culverts!$AI:$CP,$S106,24)","v":{"$error":"#VALUE!"}},{"$f":"INDEX(Culverts!$AI:$CP,$S106,25)","v":{"$error":"#VALUE!"}},{"$f":"INDEX(Culverts!$AI:$CP,$S106,23)","v":{"$error":"#VALUE!"}},{"$f":"VLOOKUP(W106,'Culvert Shapes'!$A$2:$B$9,2,FALSE)*U106*V106","v":{"$error":"#VALUE!"}}]
["Proposed Improvement",null,null,null,null,null,"Anticipated Funding",null,null,null,"Remarks"]
["Planned Year:",null,null,null,null,null,"Federal:",null,0]
["Project\nImprovement\nTypes",null,null,null,null,null,"State:",null,0]
[null,null,null,null,null,null,"County:",null,0]
[null,null,null,null,null,null,"Township:",null,0]
[null,null,null,null,null,null,"Private:",null,0]
[null,null,null,null,null,null,"RAIF Request:",null,0]
["Estimated Cost:","Estimated Cost:",null,null,null,null,"Total:",null,{"$f":"SUM(I108:J113)","v":0}]
["Road owner (township or county) must provide at least 20% of funding."]
[]
["Project #: ",null,{"$f":"C94+1","v":6},"Structure Type:",null,null,1,null,null,null,null,"Eligible Structure:",null,null,{"$f":"IF(AND(OR(H119=\"Secondary\",H119=\"Township\"),D120<>\"No Maintenance\",OR(AND(G117=1,SUM(K123:K129)>=16), AND(G117=2,K123<=20))),\"Yes\",\"No\")","v":"No"},null,null,null,"Sheet",{"$f":"G117","v":1}]
["County:",null,{"$f":"IFERROR(INDEX(INDIRECT($S118),$S123,1),\"Not Found\")","v":"Not Found"},null,null,"Road Name:",null,{"$f":"IFERROR(INDEX(INDIRECT($S118),$S123,IF($G117=1,11,10)),\"Not Found\")","v":"Not Found"},null,null,null,"Latitude:",null,{"$f":"IFERROR(INDEX(INDIRECT($S118),$S123,IF($G117=1,8,7)),\"Not Found\")","v":"Not Found"},null,null,null,null,{"$f":"IF(G117=1,\"Culverts!$AI:$CP\",\"Small_Bridges!$L:$AY\")","v":"Culverts!$AI:$CP"}]
["Township:",null,{"$f":"IFERROR(INDEX(INDIRECT($S118),$S123,2),\"Not Found\")","v":"Not Found"},null,null,"Road System:",null,{"$f":"IFERROR(INDEX(INDIRECT($S119),$S123,6),\"Not Found\")","v":"Not Found"},null,null,null,"Longitude:",null,{"$f":"IFERROR(INDEX(INDIRECT($S118),$S123,IF($G117=1,9,8)),\"Not Found\")","v":"Not Found"},null,null,null,null,{"$f":"IF(G117=1,\"Culverts!$A:$H\",\"Small_Bridges!$A:$AH\")","v":"Culverts!$A:$H"}]
["Maintenance Level:",null,null,{"$f":"IFERROR(INDEX(INDIRECT($S118),$S123,IF($G117=1,12,11)),\"Not Found\")","v":"Not Found"},null,null,null,"Number Served:",null,null,{"$f":"IFERROR(INDEX(INDIRECT($S118),$S123,IF($G117=1,14,13)),\"Not Found\")","v":"Not Found"}]
["Road Surface:",null,null,{"$f":"IFERROR(INDEX(INDIRECT($S118),$S123,IF($G117=1,13,12)),\"Not Found\")","v":"Not Found"},null,null,null,"Detour Length:",null,null,{"$f":"IFERROR(INDEX(INDIRECT($S118),$S123,IF($G117=1,15,14))&\" miles\",\"Not Found\")","v":"Not Found"},null,null,null,null,null,null,null,"WORK AREA FOR CULVERT INFORMATION"]
["Small Structures",null,"Structure Description",null,null,null,null,null,null,null,{"$f":"IF(G117=1,\"Outlet (sqft)\",\"NBIS Length (ft)\")","v":"Outlet (sqft)"},null,"Overall Condition",null,null,null,null,null,"Row","Cells","Span","Rise","Shape","Area"]
["Enter SSNs Here",null,{"$f":"IFERROR(IF($G$117=1,(INDEX(Culverts!$AI:$CP,$S123,20)&\" x \"&INDEX(Culverts!$AI:$CP,$S123,24)&\"\"\"W x \"&INDEX(Culverts!$AI:$CP,$S123,25)&\"\"\"H x \"&INDEX(Culverts!$AI:$CP,$S123,28)&\"’L \"&INDEX(Culverts!$AI:$CP,$S123,21)&\" \"&INDEX(Culverts!$AI:$CP,$S123,23)),(INDEX(Small_Bridges!$L:$BW,$S123,17)&\"'L x \"& INDEX(Small_Bridges!$L:$BW,$S123,21)&\"'W \"& INDEX(Small_Bridges!$L:$BW,$S123,16)&\" \"& INDEX(Small_Bridges!$L:$BW,$S123,15))),\"\")","v":""},null,null,null,null,null,null,null,{"$f":"IF(ISERROR(X123),\"\",IF($G$117=1,X123,INDEX(Small_Bridges!$L:$AW,$S123,18)))","v":""},null,{"$f":"IFERROR(INDEX(INDIRECT($S$72),$S123,IF($G$117=1,51,31)),\"\")","v":""},null,null,null,null,null,{"$f":"IFERROR(IF($G$117=1,MATCH(A123,Culverts!$AR:$AR,0),MATCH(A123,Small_Bridges!$T:$T,0)),\"Not Found\")","v":"Not Found"},{"$f":"INDEX(Culverts!$AI:$CP,$S123,20)","v":{"$error":"#VALUE!"}},{"$f":"INDEX(Culverts!$AI:$CP,$S123,24)","v":{"$error":"#VALUE!"}},{"$f":"INDEX(Culverts!$AI:$CP,$S123,25)","v":{"$error":"#VALUE!"}},{"$f":"INDEX(Culverts!$AI:$CP,$S123,23)","v":{"$error":"#VALUE!"}},{"$f":"VLOOKUP(W123,'Culvert Shapes'!$A$2:$B$9,2,FALSE)*U123*V123","v":{"$error":"#VALUE!"}}]
[null,null,{"$f":"IFERROR(IF($G$117=1,(INDEX(Culverts!$AI:$CP,$S124,20)&\" x \"&INDEX(Culverts!$AI:$CP,$S124,24)&\"\"\"W x \"&INDEX(Culverts!$AI:$CP,$S124,25)&\"\"\"H x \"&INDEX(Culverts!$AI:$CP,$S124,28)&\"’L \"&INDEX(Culverts!$AI:$CP,$S124,21)&\" \"&INDEX(Culverts!$AI:$CP,$S124,23)),(INDEX(Small_Bridges!$L:$BW,$S124,17)&\"'L x \"& INDEX(Small_Bridges!$L:$BW,$S124,21)&\"'W \"& INDEX(Small_Bridges!$L:$BW,$S124,16)&\" \"& INDEX(Small_Bridges!$L:$BW,$S124,15))),\"\")","v":""},null,null,null,null,null,null,null,{"$f":"IF(ISERROR(X124),\"\",IF($G$117=1,X124,INDEX(Small_Bridges!$L:$AW,$S124,18)))","v":""},null,{"$f":"IFERROR(INDEX(INDIRECT($S$72),$S124,IF($G$117=1,51,31)),\"\")","v":""},null,null,null,null,null,{"$f":"IFERROR(IF($G$117=1,MATCH(A124,Culverts!$AR:$AR,0),MATCH(A124,Small_Bridges!$T:$T,0)),\"Not Found\")","v":"Not Found"},{"$f":"INDEX(Culverts!$AI:$CP,$S124,20)","v":{"$error":"#VALUE!"}},{"$f":"INDEX(Culverts!$AI:$CP,$S124,24)","v":{"$error":"#VALUE!"}},{"$f":"INDEX(Culverts!$AI:$CP,$S124,25)","v":{"$error":"#VALUE!"}},{"$f":"INDEX(Culverts!$AI:$CP,$S124,23)","v":{"$error":"#VALUE!"}},{"$f":"VLOOKUP(W124,'Culvert Shapes'!$A$2:$B$9,2,FALSE)*U124*V124","v":{"$error":"#VALUE!"}}]
[null,null,{"$f":"IFERROR(IF($G$117=1,(INDEX(Culverts!$AI:$CP,$S125,20)&\" x \"&INDEX(Culverts!$AI:$CP,$S125,24)&\"\"\"W x \"&INDEX(Culverts!$AI:$CP,$S125,25)&\"\"\"H x \"&INDEX(Culverts!$AI:$CP,$S125,28)&\"’L \"&INDEX(Culverts!$AI:$CP,$S125,21)&\" \"&INDEX(Culverts!$AI:$CP,$S125,23)),(INDEX(Small_Bridges!$L:$BW,$S125,17)&\"'L x \"& INDEX(Small_Bridges!$L:$BW,$S125,21)&\"'W \"& INDEX(Small_Bridges!$L:$BW,$S125,16)&\" \"& INDEX(Small_Bridges!$L:$BW,$S125,15))),\"\")","v":""},null,null,null,null,null,null,null,{"$f":"IF(ISERROR(X125),\"\",IF($G$117=1,X125,INDEX(Small_Bridges!$L:$AW,$S125,18)))","v":""},null,{"$f":"IFERROR(INDEX(INDIRECT($S$72),$S125,IF($G$117=1,51,31)),\"\")","v":""},null,null,null,null,null,{"$f":"IFERROR(IF($G$117=1,MATCH(A125,Culverts!$AR:$AR,0),MATCH(A125,Small_Bridges!$T:$T,0)),\"Not Found\")","v":"Not Found"},{"$f":"INDEX(Culverts!$AI:$CP,$S125,20)","v":{"$error":"#VALUE!"}},{"$f":"INDEX(Culverts!$AI:$CP,$S125,24)","v":{"$error":"#VALUE!"}},{"$f":"INDEX(Culverts!$AI:$CP,$S125,25)","v":{"$error":"#VALUE!"}},{"$f":"INDEX(Culverts!$AI:$CP,$S125,23)","v":{"$error":"#VALUE!"}},{"$f":"VLOOKUP(W125,'Culvert Shapes'!$A$2:$B$9,2,FALSE)*U125*V125","v":{"$error":"#VALUE!"}}]
[null,null,{"$f":"IFERROR(IF($G$117=1,(INDEX(Culverts!$AI:$CP,$S126,20)&\" x \"&INDEX(Culverts!$AI:$CP,$S126,24)&\"\"\"W x \"&INDEX(Culverts!$AI:$CP,$S126,25)&\"\"\"H x \"&INDEX(Culverts!$AI:$CP,$S126,28)&\"’L \"&INDEX(Culverts!$AI:$CP,$S126,21)&\" \"&INDEX(Culverts!$AI:$CP,$S126,23)),(INDEX(Small_Bridges!$L:$BW,$S126,17)&\"'L x \"& INDEX(Small_Bridges!$L:$BW,$S126,21)&\"'W \"& INDEX(Small_Bridges!$L:$BW,$S126,16)&\" \"& INDEX(Small_Bridges!$L:$BW,$S126,15))),\"\")","v":""},null,null,null,null,null,null,null,{"$f":"IF(ISERROR(X126),\"\",IF($G$117=1,X126,INDEX(Small_Bridges!$L:$AW,$S126,18)))","v":""},null,{"$f":"IFERROR(INDEX(INDIRECT($S$72),$S126,IF($G$117=1,51,31)),\"\")","v":""},null,null,null,null,null,{"$f":"IFERROR(IF($G$117=1,MATCH(A126,Culverts!$AR:$AR,0),MATCH(A126,Small_Bridges!$T:$T,0)),\"Not Found\")","v":"Not Found"},{"$f":"INDEX(Culverts!$AI:$CP,$S126,20)","v":{"$error":"#VALUE!"}},{"$f":"INDEX(Culverts!$AI:$CP,$S126,24)","v":{"$error":"#VALUE!"}},{"$f":"INDEX(Culverts!$AI:$CP,$S126,25)","v":{"$error":"#VALUE!"}},{"$f":"INDEX(Culverts!$AI:$CP,$S126,23)","v":{"$error":"#VALUE!"}},{"$f":"VLOOKUP(W126,'Culvert Shapes'!$A$2:$B$9,2,FALSE)*U126*V126","v":{"$error":"#VALUE!"}}]
[null,null,{"$f":"IFERROR(IF($G$117=1,(INDEX(Culverts!$AI:$CP,$S127,20)&\" x \"&INDEX(Culverts!$AI:$CP,$S127,24)&\"\"\"W x \"&INDEX(Culverts!$AI:$CP,$S127,25)&\"\"\"H x \"&INDEX(Culverts!$AI:$CP,$S127,28)&\"’L \"&INDEX(Culverts!$AI:$CP,$S127,21)&\" \"&INDEX(Culverts!$AI:$CP,$S127,23)),(INDEX(Small_Bridges!$L:$BW,$S127,17)&\"'L x \"& INDEX(Small_Bridges!$L:$BW,$S127,21)&\"'W \"& INDEX(Small_Bridges!$L:$BW,$S127,16)&\" \"& INDEX(Small_Bridges!$L:$BW,$S127,15))),\"\")","v":""},null,null,null,null,null,null,null,{"$f":"IF(ISERROR(X127),\"\",IF($G$117=1,X127,INDEX(Small_Bridges!$L:$AW,$S127,18)))","v":""},null,{"$f":"IFERROR(INDEX(INDIRECT($S$72),$S127,IF($G$117=1,51,31)),\"\")","v":""},null,null,null,null,null,{"$f":"IFERROR(IF($G$117=1,MATCH(A127,Culverts!$AR:$AR,0),MATCH(A127,Small_Bridges!$T:$T,0)),\"Not Found\")","v":"Not Found"},{"$f":"INDEX(Culverts!$AI:$CP,$S127,20)","v":{"$error":"#VALUE!"}},{"$f":"INDEX(Culverts!$AI:$CP,$S127,24)","v":{"$error":"#VALUE!"}},{"$f":"INDEX(Culverts!$AI:$CP,$S127,25)","v":{"$error":"#VALUE!"}},{"$f":"INDEX(Culverts!$AI:$CP,$S127,23)","v":{"$error":"#VALUE!"}},{"$f":"VLOOKUP(W127,'Culvert Shapes'!$A$2:$B$9,2,FALSE)*U127*V127","v":{"$error":"#VALUE!"}}]
[null,null,{"$f":"IFERROR(IF($G$117=1,(INDEX(Culverts!$AI:$CP,$S128,20)&\" x \"&INDEX(Culverts!$AI:$CP,$S128,24)&\"\"\"W x \"&INDEX(Culverts!$AI:$CP,$S128,25)&\"\"\"H x \"&INDEX(Culverts!$AI:$CP,$S128,28)&\"’L \"&INDEX(Culverts!$AI:$CP,$S128,21)&\" \"&INDEX(Culverts!$AI:$CP,$S128,23)),(INDEX(Small_Bridges!$L:$BW,$S128,17)&\"'L x \"& INDEX(Small_Bridges!$L:$BW,$S128,21)&\"'W \"& INDEX(Small_Bridges!$L:$BW,$S128,16)&\" \"& INDEX(Small_Bridges!$L:$BW,$S128,15))),\"\")","v":""},null,null,null,null,null,null,null,{"$f":"IF(ISERROR(X128),\"\",IF($G$117=1,X128,INDEX(Small_Bridges!$L:$AW,$S128,18)))","v":""},null,{"$f":"IFERROR(INDEX(INDIRECT($S$72),$S128,IF($G$117=1,51,31)),\"\")","v":""},null,null,null,null,null,{"$f":"IFERROR(IF($G$117=1,MATCH(A128,Culverts!$AR:$AR,0),MATCH(A128,Small_Bridges!$T:$T,0)),\"Not Found\")","v":"Not Found"},{"$f":"INDEX(Culverts!$AI:$CP,$S128,20)","v":{"$error":"#VALUE!"}},{"$f":"INDEX(Culverts!$AI:$CP,$S128,24)","v":{"$error":"#VALUE!"}},{"$f":"INDEX(Culverts!$AI:$CP,$S128,25)","v":{"$error":"#VALUE!"}},{"$f":"INDEX(Culverts!$AI:$CP,$S128,23)","v":{"$error":"#VALUE!"}},{"$f":"VLOOKUP(W128,'Culvert Shapes'!$A$2:$B$9,2,FALSE)*U128*V128","v":{"$error":"#VALUE!"}}]
[null,null,{"$f":"IFERROR(IF($G$117=1,(INDEX(Culverts!$AI:$CP,$S129,20)&\" x \"&INDEX(Culverts!$AI:$CP,$S129,24)&\"\"\"W x \"&INDEX(Culverts!$AI:$CP,$S129,25)&\"\"\"H x \"&INDEX(Culverts!$AI:$CP,$S129,28)&\"’L \"&INDEX(Culverts!$AI:$CP,$S129,21)&\" \"&INDEX(Culverts!$AI:$CP,$S129,23)),(INDEX(Small_Bridges!$L:$BW,$S129,17)&\"'L x \"& INDEX(Small_Bridges!$L:$BW,$S129,21)&\"'W \"& INDEX(Small_Bridges!$L:$BW,$S129,16)&\" \"& INDEX(Small_Bridges!$L:$BW,$S129,15))),\"\")","v":""},null,null,null,null,null,null,null,{"$f":"IF(ISERROR(X129),\"\",IF($G$117=1,X129,INDEX(Small_Bridges!$L:$AW,$S129,18)))","v":""},null,{"$f":"IFERROR(INDEX(INDIRECT($S$72),$S129,IF($G$117=1,51,31)),\"\")","v":""},null,null,null,null,null,{"$f":"IFERROR(IF($G$117=1,MATCH(A129,Culverts!$AR:$AR,0),MATCH(A129,Small_Bridges!$T:$T,0)),\"Not Found\")","v":"Not Found"},{"$f":"INDEX(Culverts!$AI:$CP,$S129,20)","v":{"$error":"#VALUE!"}},{"$f":"INDEX(Culverts!$AI:$CP,$S129,24)","v":{"$error":"#VALUE!"}},{"$f":"INDEX(Culverts!$AI:$CP,$S129,25)","v":{"$error":"#VALUE!"}},{"$f":"INDEX(Culverts!$AI:$CP,$S129,23)","v":{"$error":"#VALUE!"}},{"$f":"VLOOKUP(W129,'Culvert Shapes'!$A$2:$B$9,2,FALSE)*U129*V129","v":{"$error":"#VALUE!"}}]
["Proposed Improvement",null,null,null,null,null,"Anticipated Funding",null,null,null,"Remarks"]
["Planned Year:",null,null,null,null,null,"Federal:",null,0]
["Project\nImprovement\nTypes",null,null,null,null,null,"State:",null,0]
[null,null,null,null,null,null,"County:",null,0]
[null,null,null,null,null,null,"Township:",null,0]
[null,null,null,null,null,null,"Private:",null,0]
[null,null,null,null,null,null,"RAIF Request:",null,0]
["Estimated Cost:","Estimated Cost:",null,null,null,null,"Total:",null,{"$f":"SUM(I131:J136)","v":0}]
["Road owner (township or county) must provide at least 20% of funding."]
[]
["Project #: ",null,{"$f":"C117+1","v":7},"Structure Type:",null,null,2,null,null,null,null,"Eligible Structure:",null,null,{"$f":"IF(AND(OR(H142=\"Secondary\",H142=\"Township\"),D143<>\"No Maintenance\",OR(AND(G140=1,SUM(K146:K152)>=16), AND(G140=2,K146<=20))),\"Yes\",\"No\")","v":"No"},null,{"$f":"G140","v":2},null,"Sheet",{"$f":"G140","v":2}]
["County:",null,{"$f":"IFERROR(INDEX(INDIRECT($S141),$S146,1),\"Not Found\")","v":"Not Found"},null,null,"Road Name:",null,{"$f":"IFERROR(INDEX(INDIRECT($S141),$S146,IF($G140=1,11,10)),\"Not Found\")","v":"Not Found"},null,null,null,"Latitude:",null,{"$f":"IFERROR(INDEX(INDIRECT($S141),$S146,IF($G140=1,8,7)),\"Not Found\")","v":"Not Found"},null,null,null,null,{"$f":"IF(G140=1,\"Culverts!$AI:$CP\",\"Small_Bridges!$L:$AY\")","v":"Small_Bridges!$L:$AY"}]
["Township:",null,{"$f":"IFERROR(INDEX(INDIRECT($S141),$S146,2),\"Not Found\")","v":"Not Found"},null,null,"Road System:",null,{"$f":"IFERROR(INDEX(INDIRECT($S142),$S146,6),\"Not Found\")","v":"Not Found"},null,null,null,"Longitude:",null,{"$f":"IFERROR(INDEX(INDIRECT($S141),$S146,IF($G140=1,9,8)),\"Not Found\")","v":"Not Found"},null,null,null,null,{"$f":"IF(G140=1,\"Culverts!$A:$H\",\"Small_Bridges!$A:$AH\")","v":"Small_Bridges!$A:$AH"}]
["Maintenance Level:",null,null,{"$f":"IFERROR(INDEX(INDIRECT($S141),$S146,IF($G140=1,12,11)),\"Not Found\")","v":"Not Found"},null,null,null,"Number Served:",null,null,{"$f":"IFERROR(INDEX(INDIRECT($S141),$S146,IF($G140=1,14,13)),\"Not Found\")","v":"Not Found"}]
["Road Surface:",null,null,{"$f":"IFERROR(INDEX(INDIRECT($S141),$S146,IF($G140=1,13,12)),\"Not Found\")","v":"Not Found"},null,null,null,"Detour Length:",null,null,{"$f":"IFERROR(INDEX(INDIRECT($S141),$S146,IF($G140=1,15,14))&\" miles\",\"Not Found\")","v":"Not Found"},null,null,null,null,null,null,null,"WORK AREA FOR CULVERT INFORMATION"]
["Small Structures",null,"Structure Description",null,null,null,null,null,null,null,{"$f":"IF(G140=1,\"Outlet (sqft)\",\"NBIS Length (ft)\")","v":"NBIS Length (ft)"},null,"Overall Condition",null,null,null,null,null,"Row","Cells","Span","Rise","Shape","Area"]
["Enter SSNs Here",null,{"$f":"IFERROR(IF($G$140=1,(INDEX(Culverts!$AI:$CP,$S146,20)&\" x \"&INDEX(Culverts!$AI:$CP,$S146,24)&\"\"\"W x \"&INDEX(Culverts!$AI:$CP,$S146,25)&\"\"\"H x \"&INDEX(Culverts!$AI:$CP,$S146,28)&\"’L \"&INDEX(Culverts!$AI:$CP,$S146,21)&\" \"&INDEX(Culverts!$AI:$CP,$S146,23)),(INDEX(Small_Bridges!$L:$BW,$S146,17)&\"'L x \"& INDEX(Small_Bridges!$L:$BW,$S146,21)&\"'W \"& INDEX(Small_Bridges!$L:$BW,$S146,16)&\" \"& INDEX(Small_Bridges!$L:$BW,$S146,15))),\"\")","v":""},null,null,null,null,null,null,null,{"$f":"IF(ISERROR(X146),\"\",IF($G$140=1,X146,INDEX(Small_Bridges!$L:$AW,$S146,18)))","v":""},null,{"$f":"IFERROR(INDEX(INDIRECT($S$72),$S146,IF($G$140=1,51,31)),\"\")","v":""},null,null,null,null,null,{"$f":"IFERROR(IF($G$140=1,MATCH(A146,Culverts!$AR:$AR,0),MATCH(A146,Small_Bridges!$T:$T,0)),\"Not Found\")","v":"Not Found"},{"$f":"INDEX(Culverts!$AI:$CP,$S146,20)","v":{"$error":"#VALUE!"}},{"$f":"INDEX(Culverts!$AI:$CP,$S146,24)","v":{"$error":"#VALUE!"}},{"$f":"INDEX(Culverts!$AI:$CP,$S146,25)","v":{"$error":"#VALUE!"}},{"$f":"INDEX(Culverts!$AI:$CP,$S146,23)","v":{"$error":"#VALUE!"}},{"$f":"VLOOKUP(W146,'Culvert Shapes'!$A$2:$B$9,2,FALSE)*U146*V146","v":{"$error":"#VALUE!"}}]
[null,null,{"$f":"IFERROR(IF($G$140=1,(INDEX(Culverts!$AI:$CP,$S147,20)&\" x \"&INDEX(Culverts!$AI:$CP,$S147,24)&\"\"\"W x \"&INDEX(Culverts!$AI:$CP,$S147,25)&\"\"\"H x \"&INDEX(Culverts!$AI:$CP,$S147,28)&\"’L \"&INDEX(Culverts!$AI:$CP,$S147,21)&\" \"&INDEX(Culverts!$AI:$CP,$S147,23)),(INDEX(Small_Bridges!$L:$BW,$S147,17)&\"'L x \"& INDEX(Small_Bridges!$L:$BW,$S147,21)&\"'W \"& INDEX(Small_Bridges!$L:$BW,$S147,16)&\" \"& INDEX(Small_Bridges!$L:$BW,$S147,15))),\"\")","v":""},null,null,null,null,null,null,null,{"$f":"IF(ISERROR(X147),\"\",IF($G$140=1,X147,INDEX(Small_Bridges!$L:$AW,$S147,18)))","v":""},null,{"$f":"IFERROR(INDEX(INDIRECT($S$72),$S147,IF($G$140=1,51,31)),\"\")","v":""},null,null,null,null,null,{"$f":"IFERROR(IF($G$48=1,MATCH(A147,Culverts!$AR:$AR,0),MATCH(A147,Small_Bridges!$T:$T,0)),\"Not Found\")","v":"Not Found"},{"$f":"INDEX(Culverts!$AI:$CP,$S147,20)","v":{"$error":"#VALUE!"}},{"$f":"INDEX(Culverts!$AI:$CP,$S147,24)","v":{"$error":"#VALUE!"}},{"$f":"INDEX(Culverts!$AI:$CP,$S147,25)","v":{"$error":"#VALUE!"}},{"$f":"INDEX(Culverts!$AI:$CP,$S147,23)","v":{"$error":"#VALUE!"}},{"$f":"VLOOKUP(W147,'Culvert Shapes'!$A$2:$B$9,2,FALSE)*U147*V147","v":{"$error":"#VALUE!"}}]
[null,null,{"$f":"IFERROR(IF($G$140=1,(INDEX(Culverts!$AI:$CP,$S148,20)&\" x \"&INDEX(Culverts!$AI:$CP,$S148,24)&\"\"\"W x \"&INDEX(Culverts!$AI:$CP,$S148,25)&\"\"\"H x \"&INDEX(Culverts!$AI:$CP,$S148,28)&\"’L \"&INDEX(Culverts!$AI:$CP,$S148,21)&\" \"&INDEX(Culverts!$AI:$CP,$S148,23)),(INDEX(Small_Bridges!$L:$BW,$S148,17)&\"'L x \"& INDEX(Small_Bridges!$L:$BW,$S148,21)&\"'W \"& INDEX(Small_Bridges!$L:$BW,$S148,16)&\" \"& INDEX(Small_Bridges!$L:$BW,$S148,15))),\"\")","v":""},null,null,null,null,null,null,null,{"$f":"IF(ISERROR(X148),\"\",IF($G$140=1,X148,INDEX(Small_Bridges!$L:$AW,$S148,18)))","v":""},null,{"$f":"IFERROR(INDEX(INDIRECT($S$72),$S148,IF($G$140=1,51,31)),\"\")","v":""},null,null,null,null,null,{"$f":"IFERROR(IF($G$48=1,MATCH(A148,Culverts!$AR:$AR,0),MATCH(A148,Small_Bridges!$T:$T,0)),\"Not Found\")","v":"Not Found"},{"$f":"INDEX(Culverts!$AI:$CP,$S148,20)","v":{"$error":"#VALUE!"}},{"$f":"INDEX(Culverts!$AI:$CP,$S148,24)","v":{"$error":"#VALUE!"}},{"$f":"INDEX(Culverts!$AI:$CP,$S148,25)","v":{"$error":"#VALUE!"}},{"$f":"INDEX(Culverts!$AI:$CP,$S148,23)","v":{"$error":"#VALUE!"}},{"$f":"VLOOKUP(W148,'Culvert Shapes'!$A$2:$B$9,2,FALSE)*U148*V148","v":{"$error":"#VALUE!"}}]
[null,null,{"$f":"IFERROR(IF($G$140=1,(INDEX(Culverts!$AI:$CP,$S149,20)&\" x \"&INDEX(Culverts!$AI:$CP,$S149,24)&\"\"\"W x \"&INDEX(Culverts!$AI:$CP,$S149,25)&\"\"\"H x \"&INDEX(Culverts!$AI:$CP,$S149,28)&\"’L \"&INDEX(Culverts!$AI:$CP,$S149,21)&\" \"&INDEX(Culverts!$AI:$CP,$S149,23)),(INDEX(Small_Bridges!$L:$BW,$S149,17)&\"'L x \"& INDEX(Small_Bridges!$L:$BW,$S149,21)&\"'W \"& INDEX(Small_Bridges!$L:$BW,$S149,16)&\" \"& INDEX(Small_Bridges!$L:$BW,$S149,15))),\"\")","v":""},null,null,null,null,null,null,null,{"$f":"IF(ISERROR(X149),\"\",IF($G$140=1,X149,INDEX(Small_Bridges!$L:$AW,$S149,18)))","v":""},null,{"$f":"IFERROR(INDEX(INDIRECT($S$72),$S149,IF($G$140=1,51,31)),\"\")","v":""},null,null,null,null,null,{"$f":"IFERROR(IF($G$48=1,MATCH(A149,Culverts!$AR:$AR,0),MATCH(A149,Small_Bridges!$T:$T,0)),\"Not Found\")","v":"Not Found"},{"$f":"INDEX(Culverts!$AI:$CP,$S149,20)","v":{"$error":"#VALUE!"}},{"$f":"INDEX(Culverts!$AI:$CP,$S149,24)","v":{"$error":"#VALUE!"}},{"$f":"INDEX(Culverts!$AI:$CP,$S149,25)","v":{"$error":"#VALUE!"}},{"$f":"INDEX(Culverts!$AI:$CP,$S149,23)","v":{"$error":"#VALUE!"}},{"$f":"VLOOKUP(W149,'Culvert Shapes'!$A$2:$B$9,2,FALSE)*U149*V149","v":{"$error":"#VALUE!"}}]
[null,null,{"$f":"IFERROR(IF($G$140=1,(INDEX(Culverts!$AI:$CP,$S150,20)&\" x \"&INDEX(Culverts!$AI:$CP,$S150,24)&\"\"\"W x \"&INDEX(Culverts!$AI:$CP,$S150,25)&\"\"\"H x \"&INDEX(Culverts!$AI:$CP,$S150,28)&\"’L \"&INDEX(Culverts!$AI:$CP,$S150,21)&\" \"&INDEX(Culverts!$AI:$CP,$S150,23)),(INDEX(Small_Bridges!$L:$BW,$S150,17)&\"'L x \"& INDEX(Small_Bridges!$L:$BW,$S150,21)&\"'W \"& INDEX(Small_Bridges!$L:$BW,$S150,16)&\" \"& INDEX(Small_Bridges!$L:$BW,$S150,15))),\"\")","v":""},null,null,null,null,null,null,null,{"$f":"IF(ISERROR(X150),\"\",IF($G$140=1,X150,INDEX(Small_Bridges!$L:$AW,$S150,18)))","v":""},null,{"$f":"IFERROR(INDEX(INDIRECT($S$72),$S150,IF($G$140=1,51,31)),\"\")","v":""},null,null,null,null,null,{"$f":"IFERROR(IF($G$48=1,MATCH(A150,Culverts!$AR:$AR,0),MATCH(A150,Small_Bridges!$T:$T,0)),\"Not Found\")","v":"Not Found"},{"$f":"INDEX(Culverts!$AI:$CP,$S150,20)","v":{"$error":"#VALUE!"}},{"$f":"INDEX(Culverts!$AI:$CP,$S150,24)","v":{"$error":"#VALUE!"}},{"$f":"INDEX(Culverts!$AI:$CP,$S150,25)","v":{"$error":"#VALUE!"}},{"$f":"INDEX(Culverts!$AI:$CP,$S150,23)","v":{"$error":"#VALUE!"}},{"$f":"VLOOKUP(W150,'Culvert Shapes'!$A$2:$B$9,2,FALSE)*U150*V150","v":{"$error":"#VALUE!"}}]
[null,null,{"$f":"IFERROR(IF($G$140=1,(INDEX(Culverts!$AI:$CP,$S151,20)&\" x \"&INDEX(Culverts!$AI:$CP,$S151,24)&\"\"\"W x \"&INDEX(Culverts!$AI:$CP,$S151,25)&\"\"\"H x \"&INDEX(Culverts!$AI:$CP,$S151,28)&\"’L \"&INDEX(Culverts!$AI:$CP,$S151,21)&\" \"&INDEX(Culverts!$AI:$CP,$S151,23)),(INDEX(Small_Bridges!$L:$BW,$S151,17)&\"'L x \"& INDEX(Small_Bridges!$L:$BW,$S151,21)&\"'W \"& INDEX(Small_Bridges!$L:$BW,$S151,16)&\" \"& INDEX(Small_Bridges!$L:$BW,$S151,15))),\"\")","v":""},null,null,null,null,null,null,null,{"$f":"IF(ISERROR(X151),\"\",IF($G$140=1,X151,INDEX(Small_Bridges!$L:$AW,$S151,18)))","v":""},null,{"$f":"IFERROR(INDEX(INDIRECT($S$72),$S151,IF($G$140=1,51,31)),\"\")","v":""},null,null,null,null,null,{"$f":"IFERROR(IF($G$48=1,MATCH(A151,Culverts!$AR:$AR,0),MATCH(A151,Small_Bridges!$T:$T,0)),\"Not Found\")","v":"Not Found"},{"$f":"INDEX(Culverts!$AI:$CP,$S151,20)","v":{"$error":"#VALUE!"}},{"$f":"INDEX(Culverts!$AI:$CP,$S151,24)","v":{"$error":"#VALUE!"}},{"$f":"INDEX(Culverts!$AI:$CP,$S151,25)","v":{"$error":"#VALUE!"}},{"$f":"INDEX(Culverts!$AI:$CP,$S151,23)","v":{"$error":"#VALUE!"}},{"$f":"VLOOKUP(W151,'Culvert Shapes'!$A$2:$B$9,2,FALSE)*U151*V151","v":{"$error":"#VALUE!"}}]
[null,null,{"$f":"IFERROR(IF($G$140=1,(INDEX(Culverts!$AI:$CP,$S152,20)&\" x \"&INDEX(Culverts!$AI:$CP,$S152,24)&\"\"\"W x \"&INDEX(Culverts!$AI:$CP,$S152,25)&\"\"\"H x \"&INDEX(Culverts!$AI:$CP,$S152,28)&\"’L \"&INDEX(Culverts!$AI:$CP,$S152,21)&\" \"&INDEX(Culverts!$AI:$CP,$S152,23)),(INDEX(Small_Bridges!$L:$BW,$S152,17)&\"'L x \"& INDEX(Small_Bridges!$L:$BW,$S152,21)&\"'W \"& INDEX(Small_Bridges!$L:$BW,$S152,16)&\" \"& INDEX(Small_Bridges!$L:$BW,$S152,15))),\"\")","v":""},null,null,null,null,null,null,null,{"$f":"IF(ISERROR(X152),\"\",IF($G$140=1,X152,INDEX(Small_Bridges!$L:$AW,$S152,18)))","v":""},null,{"$f":"IFERROR(INDEX(INDIRECT($S$72),$S152,IF($G$140=1,51,31)),\"\")","v":""},null,null,null,null,null,{"$f":"IFERROR(IF($G$48=1,MATCH(A152,Culverts!$AR:$AR,0),MATCH(A152,Small_Bridges!$T:$T,0)),\"Not Found\")","v":"Not Found"},{"$f":"INDEX(Culverts!$AI:$CP,$S152,20)","v":{"$error":"#VALUE!"}},{"$f":"INDEX(Culverts!$AI:$CP,$S152,24)","v":{"$error":"#VALUE!"}},{"$f":"INDEX(Culverts!$AI:$CP,$S152,25)","v":{"$error":"#VALUE!"}},{"$f":"INDEX(Culverts!$AI:$CP,$S152,23)","v":{"$error":"#VALUE!"}},{"$f":"VLOOKUP(W152,'Culvert Shapes'!$A$2:$B$9,2,FALSE)*U152*V152","v":{"$error":"#VALUE!"}}]
["Proposed Improvement",null,null,null,null,null,"Anticipated Funding",null,null,null,"Remarks"]
["Planned Year:",null,null,null,null,null,"Federal:",null,0]
["Project\nImprovement\nTypes",null,null,null,null,null,"State:",null,0]
[null,null,null,null,null,null,"County:",null,0]
[null,null,null,null,null,null,"Township:",null,0]
[null,null,null,null,null,null,"Private:",null,0]
[null,null,null,null,null,null,"RAIF Request:",null,0]
["Estimated Cost:","Estimated Cost:",null,null,null,null,"Total:",null,{"$f":"SUM(I154:J159)","v":0}]
["Road owner (township or county) must provide at least 20% of funding."]
[]
["Project #: ",null,{"$f":"C140+1","v":8},"Structure Type:",null,null,2,null,null,null,null,"Eligible Structure:",null,null,{"$f":"IF(AND(OR(H165=\"Secondary\",H165=\"Township\"),D166<>\"No Maintenance\",OR(AND(G163=1,SUM(K169:K175)>=16), AND(G163=2,K169<=20))),\"Yes\",\"No\")","v":"No"},null,{"$f":"G163","v":2},null,"Sheet",{"$f":"G163","v":2}]
["County:",null,{"$f":"IFERROR(INDEX(INDIRECT($S164),$S169,1),\"Not Found\")","v":"Not Found"},null,null,"Road Name:",null,{"$f":"IFERROR(INDEX(INDIRECT($S164),$S169,IF($G163=1,11,10)),\"Not Found\")","v":"Not Found"},null,null,null,"Latitude:",null,{"$f":"IFERROR(INDEX(INDIRECT($S164),$S169,IF($G163=1,8,7)),\"Not Found\")","v":"Not Found"},null,null,null,null,{"$f":"IF(G163=1,\"Culverts!$AI:$CP\",\"Small_Bridges!$L:$AY\")","v":"Small_Bridges!$L:$AY"}]
["Township:",null,{"$f":"IFERROR(INDEX(INDIRECT($S164),$S169,2),\"Not Found\")","v":"Not Found"},null,null,"Road System:",null,{"$f":"IFERROR(INDEX(INDIRECT($S165),$S169,6),\"Not Found\")","v":"Not Found"},null,null,null,"Longitude:",null,{"$f":"IFERROR(INDEX(INDIRECT($S164),$S169,IF($G163=1,9,8)),\"Not Found\")","v":"Not Found"},null,null,null,null,{"$f":"IF(G163=1,\"Culverts!$A:$H\",\"Small_Bridges!$A:$AH\")","v":"Small_Bridges!$A:$AH"}]
["Maintenance Level:",null,null,{"$f":"IFERROR(INDEX(INDIRECT($S164),$S169,IF($G163=1,12,11)),\"Not Found\")","v":"Not Found"},null,null,null,"Number Served:",null,null,{"$f":"IFERROR(INDEX(INDIRECT($S164),$S169,IF($G163=1,14,13)),\"Not Found\")","v":"Not Found"}]
["Road Surface:",null,null,{"$f":"IFERROR(INDEX(INDIRECT($S164),$S169,IF($G163=1,13,12)),\"Not Found\")","v":"Not Found"},null,null,null,"Detour Length:",null,null,{"$f":"IFERROR(INDEX(INDIRECT($S164),$S169,IF($G163=1,15,14))&\" miles\",\"Not Found\")","v":"Not Found"},null,null,null,null,null,null,null,"WORK AREA FOR CULVERT INFORMATION"]
["Small Structures",null,"Structure Description",null,null,null,null,null,null,null,{"$f":"IF(G163=1,\"Outlet (sqft)\",\"NBIS Length (ft)\")","v":"NBIS Length (ft)"},null,"Overall Condition",null,null,null,null,null,"Row","Cells","Span","Rise","Shape","Area"]
["Enter SSNs Here",null,{"$f":"IFERROR(IF($G$163=1,(INDEX(Culverts!$AI:$CP,$S169,20)&\" x \"&INDEX(Culverts!$AI:$CP,$S169,24)&\"\"\"W x \"&INDEX(Culverts!$AI:$CP,$S169,25)&\"\"\"H x \"&INDEX(Culverts!$AI:$CP,$S169,28)&\"’L \"&INDEX(Culverts!$AI:$CP,$S169,21)&\" \"&INDEX(Culverts!$AI:$CP,$S169,23)),(INDEX(Small_Bridges!$L:$BW,$S169,17)&\"'L x \"& INDEX(Small_Bridges!$L:$BW,$S169,21)&\"'W \"& INDEX(Small_Bridges!$L:$BW,$S169,16)&\" \"& INDEX(Small_Bridges!$L:$BW,$S169,15))),\"\")","v":""},null,null,null,null,null,null,null,{"$f":"IF(ISERROR(X169),\"\",IF($G$163=1,X169,INDEX(Small_Bridges!$L:$AW,$S169,18)))","v":""},null,{"$f":"IFERROR(INDEX(INDIRECT($S$72),$S169,IF($G$163=1,51,31)),\"\")","v":""},null,null,null,null,null,{"$f":"IFERROR(IF($G$163=1,MATCH(A169,Culverts!$AR:$AR,0),MATCH(A169,Small_Bridges!$T:$T,0)),\"Not Found\")","v":"Not Found"},{"$f":"INDEX(Culverts!$AI:$CP,$S169,20)","v":{"$error":"#VALUE!"}},{"$f":"INDEX(Culverts!$AI:$CP,$S169,24)","v":{"$error":"#VALUE!"}},{"$f":"INDEX(Culverts!$AI:$CP,$S169,25)","v":{"$error":"#VALUE!"}},{"$f":"INDEX(Culverts!$AI:$CP,$S169,23)","v":{"$error":"#VALUE!"}},{"$f":"VLOOKUP(W169,'Culvert Shapes'!$A$2:$B$9,2,FALSE)*U169*V169","v":{"$error":"#VALUE!"}}]
[null,null,{"$f":"IFERROR(IF($G$163=1,(INDEX(Culverts!$AI:$CP,$S170,20)&\" x \"&INDEX(Culverts!$AI:$CP,$S170,24)&\"\"\"W x \"&INDEX(Culverts!$AI:$CP,$S170,25)&\"\"\"H x \"&INDEX(Culverts!$AI:$CP,$S170,28)&\"’L \"&INDEX(Culverts!$AI:$CP,$S170,21)&\" \"&INDEX(Culverts!$AI:$CP,$S170,23)),(INDEX(Small_Bridges!$L:$BW,$S170,17)&\"'L x \"& INDEX(Small_Bridges!$L:$BW,$S170,21)&\"'W \"& INDEX(Small_Bridges!$L:$BW,$S170,16)&\" \"& INDEX(Small_Bridges!$L:$BW,$S170,15))),\"\")","v":""},null,null,null,null,null,null,null,{"$f":"IF(ISERROR(X170),\"\",IF($G$163=1,X170,INDEX(Small_Bridges!$L:$AW,$S170,18)))","v":""},null,{"$f":"IFERROR(INDEX(INDIRECT($S$72),$S170,IF($G$163=1,51,31)),\"\")","v":""},null,null,null,null,null,{"$f":"IFERROR(IF($G$48=1,MATCH(A170,Culverts!$AR:$AR,0),MATCH(A170,Small_Bridges!$T:$T,0)),\"Not Found\")","v":"Not Found"},{"$f":"INDEX(Culverts!$AI:$CP,$S170,20)","v":{"$error":"#VALUE!"}},{"$f":"INDEX(Culverts!$AI:$CP,$S170,24)","v":{"$error":"#VALUE!"}},{"$f":"INDEX(Culverts!$AI:$CP,$S170,25)","v":{"$error":"#VALUE!"}},{"$f":"INDEX(Culverts!$AI:$CP,$S170,23)","v":{"$error":"#VALUE!"}},{"$f":"VLOOKUP(W170,'Culvert Shapes'!$A$2:$B$9,2,FALSE)*U170*V170","v":{"$error":"#VALUE!"}}]
[null,null,{"$f":"IFERROR(IF($G$163=1,(INDEX(Culverts!$AI:$CP,$S171,20)&\" x \"&INDEX(Culverts!$AI:$CP,$S171,24)&\"\"\"W x \"&INDEX(Culverts!$AI:$CP,$S171,25)&\"\"\"H x \"&INDEX(Culverts!$AI:$CP,$S171,28)&\"’L \"&INDEX(Culverts!$AI:$CP,$S171,21)&\" \"&INDEX(Culverts!$AI:$CP,$S171,23)),(INDEX(Small_Bridges!$L:$BW,$S171,17)&\"'L x \"& INDEX(Small_Bridges!$L:$BW,$S171,21)&\"'W \"& INDEX(Small_Bridges!$L:$BW,$S171,16)&\" \"& INDEX(Small_Bridges!$L:$BW,$S171,15))),\"\")","v":""},null,null,null,null,null,null,null,{"$f":"IF(ISERROR(X171),\"\",IF($G$163=1,X171,INDEX(Small_Bridges!$L:$AW,$S171,18)))","v":""},null,{"$f":"IFERROR(INDEX(INDIRECT($S$72),$S171,IF($G$163=1,51,31)),\"\")","v":""},null,null,null,null,null,{"$f":"IFERROR(IF($G$48=1,MATCH(A171,Culverts!$AR:$AR,0),MATCH(A171,Small_Bridges!$T:$T,0)),\"Not Found\")","v":"Not Found"},{"$f":"INDEX(Culverts!$AI:$CP,$S171,20)","v":{"$error":"#VALUE!"}},{"$f":"INDEX(Culverts!$AI:$CP,$S171,24)","v":{"$error":"#VALUE!"}},{"$f":"INDEX(Culverts!$AI:$CP,$S171,25)","v":{"$error":"#VALUE!"}},{"$f":"INDEX(Culverts!$AI:$CP,$S171,23)","v":{"$error":"#VALUE!"}},{"$f":"VLOOKUP(W171,'Culvert Shapes'!$A$2:$B$9,2,FALSE)*U171*V171","v":{"$error":"#VALUE!"}}]
[null,null,{"$f":"IFERROR(IF($G$163=1,(INDEX(Culverts!$AI:$CP,$S172,20)&\" x \"&INDEX(Culverts!$AI:$CP,$S172,24)&\"\"\"W x \"&INDEX(Culverts!$AI:$CP,$S172,25)&\"\"\"H x \"&INDEX(Culverts!$AI:$CP,$S172,28)&\"’L \"&INDEX(Culverts!$AI:$CP,$S172,21)&\" \"&INDEX(Culverts!$AI:$CP,$S172,23)),(INDEX(Small_Bridges!$L:$BW,$S172,17)&\"'L x \"& INDEX(Small_Bridges!$L:$BW,$S172,21)&\"'W \"& INDEX(Small_Bridges!$L:$BW,$S172,16)&\" \"& INDEX(Small_Bridges!$L:$BW,$S172,15))),\"\")","v":""},null,null,null,null,null,null,null,{"$f":"IF(ISERROR(X172),\"\",IF($G$163=1,X172,INDEX(Small_Bridges!$L:$AW,$S172,18)))","v":""},null,{"$f":"IFERROR(INDEX(INDIRECT($S$72),$S172,IF($G$163=1,51,31)),\"\")","v":""},null,null,null,null,null,{"$f":"IFERROR(IF($G$48=1,MATCH(A172,Culverts!$AR:$AR,0),MATCH(A172,Small_Bridges!$T:$T,0)),\"Not Found\")","v":"Not Found"},{"$f":"INDEX(Culverts!$AI:$CP,$S172,20)","v":{"$error":"#VALUE!"}},{"$f":"INDEX(Culverts!$AI:$CP,$S172,24)","v":{"$error":"#VALUE!"}},{"$f":"INDEX(Culverts!$AI:$CP,$S172,25)","v":{"$error":"#VALUE!"}},{"$f":"INDEX(Culverts!$AI:$CP,$S172,23)","v":{"$error":"#VALUE!"}},{"$f":"VLOOKUP(W172,'Culvert Shapes'!$A$2:$B$9,2,FALSE)*U172*V172","v":{"$error":"#VALUE!"}}]
[null,null,{"$f":"IFERROR(IF($G$163=1,(INDEX(Culverts!$AI:$CP,$S173,20)&\" x \"&INDEX(Culverts!$AI:$CP,$S173,24)&\"\"\"W x \"&INDEX(Culverts!$AI:$CP,$S173,25)&\"\"\"H x \"&INDEX(Culverts!$AI:$CP,$S173,28)&\"’L \"&INDEX(Culverts!$AI:$CP,$S173,21)&\" \"&INDEX(Culverts!$AI:$CP,$S173,23)),(INDEX(Small_Bridges!$L:$BW,$S173,17)&\"'L x \"& INDEX(Small_Bridges!$L:$BW,$S173,21)&\"'W \"& INDEX(Small_Bridges!$L:$BW,$S173,16)&\" \"& INDEX(Small_Bridges!$L:$BW,$S173,15))),\"\")","v":""},null,null,null,null,null,null,null,{"$f":"IF(ISERROR(X173),\"\",IF($G$163=1,X173,INDEX(Small_Bridges!$L:$AW,$S173,18)))","v":""},null,{"$f":"IFERROR(INDEX(INDIRECT($S$72),$S173,IF($G$163=1,51,31)),\"\")","v":""},null,null,null,null,null,{"$f":"IFERROR(IF($G$48=1,MATCH(A173,Culverts!$AR:$AR,0),MATCH(A173,Small_Bridges!$T:$T,0)),\"Not Found\")","v":"Not Found"},{"$f":"INDEX(Culverts!$AI:$CP,$S173,20)","v":{"$error":"#VALUE!"}},{"$f":"INDEX(Culverts!$AI:$CP,$S173,24)","v":{"$error":"#VALUE!"}},{"$f":"INDEX(Culverts!$AI:$CP,$S173,25)","v":{"$error":"#VALUE!"}},{"$f":"INDEX(Culverts!$AI:$CP,$S173,23)","v":{"$error":"#VALUE!"}},{"$f":"VLOOKUP(W173,'Culvert Shapes'!$A$2:$B$9,2,FALSE)*U173*V173","v":{"$error":"#VALUE!"}}]
[null,null,{"$f":"IFERROR(IF($G$163=1,(INDEX(Culverts!$AI:$CP,$S174,20)&\" x \"&INDEX(Culverts!$AI:$CP,$S174,24)&\"\"\"W x \"&INDEX(Culverts!$AI:$CP,$S174,25)&\"\"\"H x \"&INDEX(Culverts!$AI:$CP,$S174,28)&\"’L \"&INDEX(Culverts!$AI:$CP,$S174,21)&\" \"&INDEX(Culverts!$AI:$CP,$S174,23)),(INDEX(Small_Bridges!$L:$BW,$S174,17)&\"'L x \"& INDEX(Small_Bridges!$L:$BW,$S174,21)&\"'W \"& INDEX(Small_Bridges!$L:$BW,$S174,16)&\" \"& INDEX(Small_Bridges!$L:$BW,$S174,15))),\"\")","v":""},null,null,null,null,null,null,null,{"$f":"IF(ISERROR(X174),\"\",IF($G$163=1,X174,INDEX(Small_Bridges!$L:$AW,$S174,18)))","v":""},null,{"$f":"IFERROR(INDEX(INDIRECT($S$72),$S174,IF($G$163=1,51,31)),\"\")","v":""},null,null,null,null,null,{"$f":"IFERROR(IF($G$48=1,MATCH(A174,Culverts!$AR:$AR,0),MATCH(A174,Small_Bridges!$T:$T,0)),\"Not Found\")","v":"Not Found"},{"$f":"INDEX(Culverts!$AI:$CP,$S174,20)","v":{"$error":"#VALUE!"}},{"$f":"INDEX(Culverts!$AI:$CP,$S174,24)","v":{"$error":"#VALUE!"}},{"$f":"INDEX(Culverts!$AI:$CP,$S174,25)","v":{"$error":"#VALUE!"}},{"$f":"INDEX(Culverts!$AI:$CP,$S174,23)","v":{"$error":"#VALUE!"}},{"$f":"VLOOKUP(W174,'Culvert Shapes'!$A$2:$B$9,2,FALSE)*U174*V174","v":{"$error":"#VALUE!"}}]
[null,null,{"$f":"IFERROR(IF($G$163=1,(INDEX(Culverts!$AI:$CP,$S175,20)&\" x \"&INDEX(Culverts!$AI:$CP,$S175,24)&\"\"\"W x \"&INDEX(Culverts!$AI:$CP,$S175,25)&\"\"\"H x \"&INDEX(Culverts!$AI:$CP,$S175,28)&\"’L \"&INDEX(Culverts!$AI:$CP,$S175,21)&\" \"&INDEX(Culverts!$AI:$CP,$S175,23)),(INDEX(Small_Bridges!$L:$BW,$S175,17)&\"'L x \"& INDEX(Small_Bridges!$L:$BW,$S175,21)&\"'W \"& INDEX(Small_Bridges!$L:$BW,$S175,16)&\" \"& INDEX(Small_Bridges!$L:$BW,$S175,15))),\"\")","v":""},null,null,null,null,null,null,null,{"$f":"IF(ISERROR(X175),\"\",IF($G$163=1,X175,INDEX(Small_Bridges!$L:$AW,$S175,18)))","v":""},null,{"$f":"IFERROR(INDEX(INDIRECT($S$72),$S175,IF($G$163=1,51,31)),\"\")","v":""},null,null,null,null,null,{"$f":"IFERROR(IF($G$48=1,MATCH(A175,Culverts!$AR:$AR,0),MATCH(A175,Small_Bridges!$T:$T,0)),\"Not Found\")","v":"Not Found"},{"$f":"INDEX(Culverts!$AI:$CP,$S175,20)","v":{"$error":"#VALUE!"}},{"$f":"INDEX(Culverts!$AI:$CP,$S175,24)","v":{"$error":"#VALUE!"}},{"$f":"INDEX(Culverts!$AI:$CP,$S175,25)","v":{"$error":"#VALUE!"}},{"$f":"INDEX(Culverts!$AI:$CP,$S175,23)","v":{"$error":"#VALUE!"}},{"$f":"VLOOKUP(W175,'Culvert Shapes'!$A$2:$B$9,2,FALSE)*U175*V175","v":{"$error":"#VALUE!"}}]
["Proposed Improvement",null,null,null,null,null,"Anticipated Funding",null,null,null,"Remarks"]
["Planned Year:",null,null,null,null,null,"Federal:",null,0]
["Project\nImprovement\nTypes",null,null,null,null,null,"State:",null,0]
[null,null,null,null,null,null,"County:",null,0]
[null,null,null,null,null,null,"Township:",null,0]
[null,null,null,null,null,null,"Private:",null,0]
[null,null,null,null,null,null,"RAIF Request:",null,0]
["Estimated Cost:","Estimated Cost:",null,null,null,null,"Total:",null,{"$f":"SUM(I177:J182)","v":0}]
["Road owner (township or county) must provide at least 20% of funding."]
[]
["Project #: ",null,{"$f":"C163+1","v":9},"Structure Type:",null,null,1,null,null,null,null,"Eligible Structure:",null,null,{"$f":"IF(AND(OR(H188=\"Secondary\",H188=\"Township\"),D189<>\"No Maintenance\",OR(AND(G186=1,SUM(K192:K198)>=16), AND(G186=2,K192<=20))),\"Yes\",\"No\")","v":"No"},null,{"$f":"G186","v":1},null,"Sheet",{"$f":"G186","v":1}]
["County:",null,{"$f":"IFERROR(INDEX(INDIRECT($S187),$S192,1),\"Not Found\")","v":"Not Found"},null,null,"Road Name:",null,{"$f":"IFERROR(INDEX(INDIRECT($S187),$S192,IF($G186=1,11,10)),\"Not Found\")","v":"Not Found"},null,null,null,"Latitude:",null,{"$f":"IFERROR(INDEX(INDIRECT($S187),$S192,IF($G186=1,8,7)),\"Not Found\")","v":"Not Found"},null,null,null,null,{"$f":"IF(G186=1,\"Culverts!$AI:$CP\",\"Small_Bridges!$L:$AY\")","v":"Culverts!$AI:$CP"}]
["Township:",null,{"$f":"IFERROR(INDEX(INDIRECT($S187),$S192,2),\"Not Found\")","v":"Not Found"},null,null,"Road System:",null,{"$f":"IFERROR(INDEX(INDIRECT($S188),$S192,6),\"Not Found\")","v":"Not Found"},null,null,null,"Longitude:",null,{"$f":"IFERROR(INDEX(INDIRECT($S187),$S192,IF($G186=1,9,8)),\"Not Found\")","v":"Not Found"},null,null,null,null,{"$f":"IF(G186=1,\"Culverts!$A:$H\",\"Small_Bridges!$A:$AH\")","v":"Culverts!$A:$H"}]
["Maintenance Level:",null,null,{"$f":"IFERROR(INDEX(INDIRECT($S187),$S192,IF($G186=1,12,11)),\"Not Found\")","v":"Not Found"},null,null,null,"Number Served:",null,null,{"$f":"IFERROR(INDEX(INDIRECT($S187),$S192,IF($G186=1,14,13)),\"Not Found\")","v":"Not Found"}]
["Road Surface:",null,null,{"$f":"IFERROR(INDEX(INDIRECT($S187),$S192,IF($G186=1,13,12)),\"Not Found\")","v":"Not Found"},null,null,null,"Detour Length:",null,null,{"$f":"IFERROR(INDEX(INDIRECT($S187),$S192,IF($G186=1,15,14))&\" miles\",\"Not Found\")","v":"Not Found"},null,null,null,null,null,null,null,"WORK AREA FOR CULVERT INFORMATION"]
["Small Structures",null,"Structure Description",null,null,null,null,null,null,null,{"$f":"IF(G186=1,\"Outlet (sqft)\",\"NBIS Length (ft)\")","v":"Outlet (sqft)"},null,"Overall Condition",null,null,null,null,null,"Row","Cells","Span","Rise","Shape","Area"]
["Enter SSNs Here",null,{"$f":"IFERROR(IF($G$186=1,(INDEX(Culverts!$AI:$CP,$S192,20)&\" x \"&INDEX(Culverts!$AI:$CP,$S192,24)&\"\"\"W x \"&INDEX(Culverts!$AI:$CP,$S192,25)&\"\"\"H x \"&INDEX(Culverts!$AI:$CP,$S192,28)&\"’L \"&INDEX(Culverts!$AI:$CP,$S192,21)&\" \"&INDEX(Culverts!$AI:$CP,$S192,23)),(INDEX(Small_Bridges!$L:$BW,$S192,17)&\"'L x \"& INDEX(Small_Bridges!$L:$BW,$S192,21)&\"'W \"& INDEX(Small_Bridges!$L:$BW,$S192,16)&\" \"& INDEX(Small_Bridges!$L:$BW,$S192,15))),\"\")","v":""},null,null,null,null,null,null,null,{"$f":"IF(ISERROR(X192),\"\",IF($G$186=1,X192,INDEX(Small_Bridges!$L:$AW,$S192,18)))","v":""},null,{"$f":"IFERROR(INDEX(INDIRECT($S$72),$S192,IF($G$186=1,51,31)),\"\")","v":""},null,null,null,null,null,{"$f":"IFERROR(IF($G$186=1,MATCH(A192,Culverts!$AR:$AR,0),MATCH(A192,Small_Bridges!$T:$T,0)),\"Not Found\")","v":"Not Found"},{"$f":"INDEX(Culverts!$AI:$CP,$S192,20)","v":{"$error":"#VALUE!"}},{"$f":"INDEX(Culverts!$AI:$CP,$S192,24)","v":{"$error":"#VALUE!"}},{"$f":"INDEX(Culverts!$AI:$CP,$S192,25)","v":{"$error":"#VALUE!"}},{"$f":"INDEX(Culverts!$AI:$CP,$S192,23)","v":{"$error":"#VALUE!"}},{"$f":"VLOOKUP(W192,'Culvert Shapes'!$A$2:$B$9,2,FALSE)*U192*V192","v":{"$error":"#VALUE!"}}]
[null,null,{"$f":"IFERROR(IF($G$186=1,(INDEX(Culverts!$AI:$CP,$S193,20)&\" x \"&INDEX(Culverts!$AI:$CP,$S193,24)&\"\"\"W x \"&INDEX(Culverts!$AI:$CP,$S193,25)&\"\"\"H x \"&INDEX(Culverts!$AI:$CP,$S193,28)&\"’L \"&INDEX(Culverts!$AI:$CP,$S193,21)&\" \"&INDEX(Culverts!$AI:$CP,$S193,23)),(INDEX(Small_Bridges!$L:$BW,$S193,17)&\"'L x \"& INDEX(Small_Bridges!$L:$BW,$S193,21)&\"'W \"& INDEX(Small_Bridges!$L:$BW,$S193,16)&\" \"& INDEX(Small_Bridges!$L:$BW,$S193,15))),\"\")","v":""},null,null,null,null,null,null,null,{"$f":"IF(ISERROR(X193),\"\",IF($G$186=1,X193,INDEX(Small_Bridges!$L:$AW,$S193,18)))","v":""},null,{"$f":"IFERROR(INDEX(INDIRECT($S$72),$S193,IF($G$186=1,51,31)),\"\")","v":""},null,null,null,null,null,{"$f":"IFERROR(IF($G$48=1,MATCH(A193,Culverts!$AR:$AR,0),MATCH(A193,Small_Bridges!$T:$T,0)),\"Not Found\")","v":"Not Found"},{"$f":"INDEX(Culverts!$AI:$CP,$S193,20)","v":{"$error":"#VALUE!"}},{"$f":"INDEX(Culverts!$AI:$CP,$S193,24)","v":{"$error":"#VALUE!"}},{"$f":"INDEX(Culverts!$AI:$CP,$S193,25)","v":{"$error":"#VALUE!"}},{"$f":"INDEX(Culverts!$AI:$CP,$S193,23)","v":{"$error":"#VALUE!"}},{"$f":"VLOOKUP(W193,'Culvert Shapes'!$A$2:$B$9,2,FALSE)*U193*V193","v":{"$error":"#VALUE!"}}]
[null,null,{"$f":"IFERROR(IF($G$186=1,(INDEX(Culverts!$AI:$CP,$S194,20)&\" x \"&INDEX(Culverts!$AI:$CP,$S194,24)&\"\"\"W x \"&INDEX(Culverts!$AI:$CP,$S194,25)&\"\"\"H x \"&INDEX(Culverts!$AI:$CP,$S194,28)&\"’L \"&INDEX(Culverts!$AI:$CP,$S194,21)&\" \"&INDEX(Culverts!$AI:$CP,$S194,23)),(INDEX(Small_Bridges!$L:$BW,$S194,17)&\"'L x \"& INDEX(Small_Bridges!$L:$BW,$S194,21)&\"'W \"& INDEX(Small_Bridges!$L:$BW,$S194,16)&\" \"& INDEX(Small_Bridges!$L:$BW,$S194,15))),\"\")","v":""},null,null,null,null,null,null,null,{"$f":"IF(ISERROR(X194),\"\",IF($G$186=1,X194,INDEX(Small_Bridges!$L:$AW,$S194,18)))","v":""},null,{"$f":"IFERROR(INDEX(INDIRECT($S$72),$S194,IF($G$186=1,51,31)),\"\")","v":""},null,null,null,null,null,{"$f":"IFERROR(IF($G$48=1,MATCH(A194,Culverts!$AR:$AR,0),MATCH(A194,Small_Bridges!$T:$T,0)),\"Not Found\")","v":"Not Found"},{"$f":"INDEX(Culverts!$AI:$CP,$S194,20)","v":{"$error":"#VALUE!"}},{"$f":"INDEX(Culverts!$AI:$CP,$S194,24)","v":{"$error":"#VALUE!"}},{"$f":"INDEX(Culverts!$AI:$CP,$S194,25)","v":{"$error":"#VALUE!"}},{"$f":"INDEX(Culverts!$AI:$CP,$S194,23)","v":{"$error":"#VALUE!"}},{"$f":"VLOOKUP(W194,'Culvert Shapes'!$A$2:$B$9,2,FALSE)*U194*V194","v":{"$error":"#VALUE!"}}]
[null,null,{"$f":"IFERROR(IF($G$186=1,(INDEX(Culverts!$AI:$CP,$S195,20)&\" x \"&INDEX(Culverts!$AI:$CP,$S195,24)&\"\"\"W x \"&INDEX(Culverts!$AI:$CP,$S195,25)&\"\"\"H x \"&INDEX(Culverts!$AI:$CP,$S195,28)&\"’L \"&INDEX(Culverts!$AI:$CP,$S195,21)&\" \"&INDEX(Culverts!$AI:$CP,$S195,23)),(INDEX(Small_Bridges!$L:$BW,$S195,17)&\"'L x \"& INDEX(Small_Bridges!$L:$BW,$S195,21)&\"'W \"& INDEX(Small_Bridges!$L:$BW,$S195,16)&\" \"& INDEX(Small_Bridges!$L:$BW,$S195,15))),\"\")","v":""},null,null,null,null,null,null,null,{"$f":"IF(ISERROR(X195),\"\",IF($G$186=1,X195,INDEX(Small_Bridges!$L:$AW,$S195,18)))","v":""},null,{"$f":"IFERROR(INDEX(INDIRECT($S$72),$S195,IF($G$186=1,51,31)),\"\")","v":""},null,null,null,null,null,{"$f":"IFERROR(IF($G$48=1,MATCH(A195,Culverts!$AR:$AR,0),MATCH(A195,Small_Bridges!$T:$T,0)),\"Not Found\")","v":"Not Found"},{"$f":"INDEX(Culverts!$AI:$CP,$S195,20)","v":{"$error":"#VALUE!"}},{"$f":"INDEX(Culverts!$AI:$CP,$S195,24)","v":{"$error":"#VALUE!"}},{"$f":"INDEX(Culverts!$AI:$CP,$S195,25)","v":{"$error":"#VALUE!"}},{"$f":"INDEX(Culverts!$AI:$CP,$S195,23)","v":{"$error":"#VALUE!"}},{"$f":"VLOOKUP(W195,'Culvert Shapes'!$A$2:$B$9,2,FALSE)*U195*V195","v":{"$error":"#VALUE!"}}]
[null,null,{"$f":"IFERROR(IF($G$186=1,(INDEX(Culverts!$AI:$CP,$S196,20)&\" x \"&INDEX(Culverts!$AI:$CP,$S196,24)&\"\"\"W x \"&INDEX(Culverts!$AI:$CP,$S196,25)&\"\"\"H x \"&INDEX(Culverts!$AI:$CP,$S196,28)&\"’L \"&INDEX(Culverts!$AI:$CP,$S196,21)&\" \"&INDEX(Culverts!$AI:$CP,$S196,23)),(INDEX(Small_Bridges!$L:$BW,$S196,17)&\"'L x \"& INDEX(Small_Bridges!$L:$BW,$S196,21)&\"'W \"& INDEX(Small_Bridges!$L:$BW,$S196,16)&\" \"& INDEX(Small_Bridges!$L:$BW,$S196,15))),\"\")","v":""},null,null,null,null,null,null,null,{"$f":"IF(ISERROR(X196),\"\",IF($G$186=1,X196,INDEX(Small_Bridges!$L:$AW,$S196,18)))","v":""},null,{"$f":"IFERROR(INDEX(INDIRECT($S$72),$S196,IF($G$186=1,51,31)),\"\")","v":""},null,null,null,null,null,{"$f":"IFERROR(IF($G$48=1,MATCH(A196,Culverts!$AR:$AR,0),MATCH(A196,Small_Bridges!$T:$T,0)),\"Not Found\")","v":"Not Found"},{"$f":"INDEX(Culverts!$AI:$CP,$S196,20)","v":{"$error":"#VALUE!"}},{"$f":"INDEX(Culverts!$AI:$CP,$S196,24)","v":{"$error":"#VALUE!"}},{"$f":"INDEX(Culverts!$AI:$CP,$S196,25)","v":{"$error":"#VALUE!"}},{"$f":"INDEX(Culverts!$AI:$CP,$S196,23)","v":{"$error":"#VALUE!"}},{"$f":"VLOOKUP(W196,'Culvert Shapes'!$A$2:$B$9,2,FALSE)*U196*V196","v":{"$error":"#VALUE!"}}]
[null,null,{"$f":"IFERROR(IF($G$186=1,(INDEX(Culverts!$AI:$CP,$S197,20)&\" x \"&INDEX(Culverts!$AI:$CP,$S197,24)&\"\"\"W x \"&INDEX(Culverts!$AI:$CP,$S197,25)&\"\"\"H x \"&INDEX(Culverts!$AI:$CP,$S197,28)&\"’L \"&INDEX(Culverts!$AI:$CP,$S197,21)&\" \"&INDEX(Culverts!$AI:$CP,$S197,23)),(INDEX(Small_Bridges!$L:$BW,$S197,17)&\"'L x \"& INDEX(Small_Bridges!$L:$BW,$S197,21)&\"'W \"& INDEX(Small_Bridges!$L:$BW,$S197,16)&\" \"& INDEX(Small_Bridges!$L:$BW,$S197,15))),\"\")","v":""},null,null,null,null,null,null,null,{"$f":"IF(ISERROR(X197),\"\",IF($G$186=1,X197,INDEX(Small_Bridges!$L:$AW,$S197,18)))","v":""},null,{"$f":"IFERROR(INDEX(INDIRECT($S$72),$S197,IF($G$186=1,51,31)),\"\")","v":""},null,null,null,null,null,{"$f":"IFERROR(IF($G$48=1,MATCH(A197,Culverts!$AR:$AR,0),MATCH(A197,Small_Bridges!$T:$T,0)),\"Not Found\")","v":"Not Found"},{"$f":"INDEX(Culverts!$AI:$CP,$S197,20)","v":{"$error":"#VALUE!"}},{"$f":"INDEX(Culverts!$AI:$CP,$S197,24)","v":{"$error":"#VALUE!"}},{"$f":"INDEX(Culverts!$AI:$CP,$S197,25)","v":{"$error":"#VALUE!"}},{"$f":"INDEX(Culverts!$AI:$CP,$S197,23)","v":{"$error":"#VALUE!"}},{"$f":"VLOOKUP(W197,'Culvert Shapes'!$A$2:$B$9,2,FALSE)*U197*V197","v":{"$error":"#VALUE!"}}]
[null,null,{"$f":"IFERROR(IF($G$186=1,(INDEX(Culverts!$AI:$CP,$S198,20)&\" x \"&INDEX(Culverts!$AI:$CP,$S198,24)&\"\"\"W x \"&INDEX(Culverts!$AI:$CP,$S198,25)&\"\"\"H x \"&INDEX(Culverts!$AI:$CP,$S198,28)&\"’L \"&INDEX(Culverts!$AI:$CP,$S198,21)&\" \"&INDEX(Culverts!$AI:$CP,$S198,23)),(INDEX(Small_Bridges!$L:$BW,$S198,17)&\"'L x \"& INDEX(Small_Bridges!$L:$BW,$S198,21)&\"'W \"& INDEX(Small_Bridges!$L:$BW,$S198,16)&\" \"& INDEX(Small_Bridges!$L:$BW,$S198,15))),\"\")","v":""},null,null,null,null,null,null,null,{"$f":"IF(ISERROR(X198),\"\",IF($G$186=1,X198,INDEX(Small_Bridges!$L:$AW,$S198,18)))","v":""},null,{"$f":"IFERROR(INDEX(INDIRECT($S$72),$S198,IF($G$186=1,51,31)),\"\")","v":""},null,null,null,null,null,{"$f":"IFERROR(IF($G$48=1,MATCH(A198,Culverts!$AR:$AR,0),MATCH(A198,Small_Bridges!$T:$T,0)),\"Not Found\")","v":"Not Found"},{"$f":"INDEX(Culverts!$AI:$CP,$S198,20)","v":{"$error":"#VALUE!"}},{"$f":"INDEX(Culverts!$AI:$CP,$S198,24)","v":{"$error":"#VALUE!"}},{"$f":"INDEX(Culverts!$AI:$CP,$S198,25)","v":{"$error":"#VALUE!"}},{"$f":"INDEX(Culverts!$AI:$CP,$S198,23)","v":{"$error":"#VALUE!"}},{"$f":"VLOOKUP(W198,'Culvert Shapes'!$A$2:$B$9,2,FALSE)*U198*V198","v":{"$error":"#VALUE!"}}]
["Proposed Improvement",null,null,null,null,null,"Anticipated Funding",null,null,null,"Remarks"]
["Planned Year:",null,null,null,null,null,"Federal:",null,0]
["Project\nImprovement\nTypes",null,null,null,null,null,"State:",null,0]
[null,null,null,null,null,null,"County:",null,0]
[null,null,null,null,null,null,"Township:",null,0]
[null,null,null,null,null,null,"Private:",null,0]
[null,null,null,null,null,null,"RAIF Request:",null,0]
["Estimated Cost:","Estimated Cost:",null,null,null,null,"Total:",null,{"$f":"SUM(I200:J205)","v":0}]
["Road owner (township or county) must provide at least 20% of funding."]
[]
["Project #: ",null,{"$f":"C186+1","v":10},"Structure Type:",null,null,1,null,null,null,null,"Eligible Structure:",null,null,{"$f":"IF(AND(OR(H211=\"Secondary\",H211=\"Township\"),D212<>\"No Maintenance\",OR(AND(G209=1,SUM(K215:K221)>=16), AND(G209=2,K215<=20))),\"Yes\",\"No\")","v":"No"},null,{"$f":"G209","v":1},null,"Sheet",{"$f":"G209","v":1}]
["County:",null,{"$f":"IFERROR(INDEX(INDIRECT($S210),$S215,1),\"Not Found\")","v":"Not Found"},null,null,"Road Name:",null,{"$f":"IFERROR(INDEX(INDIRECT($S210),$S215,IF($G209=1,11,10)),\"Not Found\")","v":"Not Found"},null,null,null,"Latitude:",null,{"$f":"IFERROR(INDEX(INDIRECT($S210),$S215,IF($G209=1,8,7)),\"Not Found\")","v":"Not Found"},null,null,null,null,{"$f":"IF(G209=1,\"Culverts!$AI:$CP\",\"Small_Bridges!$L:$AY\")","v":"Culverts!$AI:$CP"}]
["Township:",null,{"$f":"IFERROR(INDEX(INDIRECT($S210),$S215,2),\"Not Found\")","v":"Not Found"},null,null,"Road System:",null,{"$f":"IFERROR(INDEX(INDIRECT($S211),$S215,6),\"Not Found\")","v":"Not Found"},null,null,null,"Longitude:",null,{"$f":"IFERROR(INDEX(INDIRECT($S210),$S215,IF($G209=1,9,8)),\"Not Found\")","v":"Not Found"},null,null,null,null,{"$f":"IF(G209=1,\"Culverts!$A:$H\",\"Small_Bridges!$A:$AH\")","v":"Culverts!$A:$H"}]
["Maintenance Level:",null,null,{"$f":"IFERROR(INDEX(INDIRECT($S210),$S215,IF($G209=1,12,11)),\"Not Found\")","v":"Not Found"},null,null,null,"Number Served:",null,null,{"$f":"IFERROR(INDEX(INDIRECT($S210),$S215,IF($G209=1,14,13)),\"Not Found\")","v":"Not Found"}]
["Road Surface:",null,null,{"$f":"IFERROR(INDEX(INDIRECT($S210),$S215,IF($G209=1,13,12)),\"Not Found\")","v":"Not Found"},null,null,null,"Detour Length:",null,null,{"$f":"IFERROR(INDEX(INDIRECT($S210),$S215,IF($G209=1,15,14))&\" miles\",\"Not Found\")","v":"Not Found"},null,null,null,null,null,null,null,"WORK AREA FOR CULVERT INFORMATION"]
["Small Structures",null,"Structure Description",null,null,null,null,null,null,null,{"$f":"IF(G209=1,\"Outlet (sqft)\",\"NBIS Length (ft)\")","v":"Outlet (sqft)"},null,"Overall Condition",null,null,null,null,null,"Row","Cells","Span","Rise","Shape","Area"]
["Enter SSNs Here",null,{"$f":"IFERROR(IF($G$209=1,(INDEX(Culverts!$AI:$CP,$S215,20)&\" x \"&INDEX(Culverts!$AI:$CP,$S215,24)&\"\"\"W x \"&INDEX(Culverts!$AI:$CP,$S215,25)&\"\"\"H x \"&INDEX(Culverts!$AI:$CP,$S215,28)&\"’L \"&INDEX(Culverts!$AI:$CP,$S215,21)&\" \"&INDEX(Culverts!$AI:$CP,$S215,23)),(INDEX(Small_Bridges!$L:$BW,$S215,17)&\"'L x \"& INDEX(Small_Bridges!$L:$BW,$S215,21)&\"'W \"& INDEX(Small_Bridges!$L:$BW,$S215,16)&\" \"& INDEX(Small_Bridges!$L:$BW,$S215,15))),\"\")","v":""},null,null,null,null,null,null,null,{"$f":"IF(ISERROR(X215),\"\",IF($G$209=1,X215,INDEX(Small_Bridges!$L:$AW,$S215,18)))","v":""},null,{"$f":"IFERROR(INDEX(INDIRECT($S$72),$S215,IF($G$209=1,51,31)),\"\")","v":""},null,null,null,null,null,{"$f":"IFERROR(IF($G$209=1,MATCH(A215,Culverts!$AR:$AR,0),MATCH(A215,Small_Bridges!$T:$T,0)),\"Not Found\")","v":"Not Found"},{"$f":"INDEX(Culverts!$AI:$CP,$S215,20)","v":{"$error":"#VALUE!"}},{"$f":"INDEX(Culverts!$AI:$CP,$S215,24)","v":{"$error":"#VALUE!"}},{"$f":"INDEX(Culverts!$AI:$CP,$S215,25)","v":{"$error":"#VALUE!"}},{"$f":"INDEX(Culverts!$AI:$CP,$S215,23)","v":{"$error":"#VALUE!"}},{"$f":"VLOOKUP(W215,'Culvert Shapes'!$A$2:$B$9,2,FALSE)*U215*V215","v":{"$error":"#VALUE!"}}]
[null,null,{"$f":"IFERROR(IF($G$209=1,(INDEX(Culverts!$AI:$CP,$S216,20)&\" x \"&INDEX(Culverts!$AI:$CP,$S216,24)&\"\"\"W x \"&INDEX(Culverts!$AI:$CP,$S216,25)&\"\"\"H x \"&INDEX(Culverts!$AI:$CP,$S216,28)&\"’L \"&INDEX(Culverts!$AI:$CP,$S216,21)&\" \"&INDEX(Culverts!$AI:$CP,$S216,23)),(INDEX(Small_Bridges!$L:$BW,$S216,17)&\"'L x \"& INDEX(Small_Bridges!$L:$BW,$S216,21)&\"'W \"& INDEX(Small_Bridges!$L:$BW,$S216,16)&\" \"& INDEX(Small_Bridges!$L:$BW,$S216,15))),\"\")","v":""},null,null,null,null,null,null,null,{"$f":"IF(ISERROR(X216),\"\",IF($G$209=1,X216,INDEX(Small_Bridges!$L:$AW,$S216,18)))","v":""},null,{"$f":"IFERROR(INDEX(INDIRECT($S$72),$S216,IF($G$209=1,51,31)),\"\")","v":""},null,null,null,null,null,{"$f":"IFERROR(IF($G$48=1,MATCH(A216,Culverts!$AR:$AR,0),MATCH(A216,Small_Bridges!$T:$T,0)),\"Not Found\")","v":"Not Found"},{"$f":"INDEX(Culverts!$AI:$CP,$S216,20)","v":{"$error":"#VALUE!"}},{"$f":"INDEX(Culverts!$AI:$CP,$S216,24)","v":{"$error":"#VALUE!"}},{"$f":"INDEX(Culverts!$AI:$CP,$S216,25)","v":{"$error":"#VALUE!"}},{"$f":"INDEX(Culverts!$AI:$CP,$S216,23)","v":{"$error":"#VALUE!"}},{"$f":"VLOOKUP(W216,'Culvert Shapes'!$A$2:$B$9,2,FALSE)*U216*V216","v":{"$error":"#VALUE!"}}]
[null,null,{"$f":"IFERROR(IF($G$209=1,(INDEX(Culverts!$AI:$CP,$S217,20)&\" x \"&INDEX(Culverts!$AI:$CP,$S217,24)&\"\"\"W x \"&INDEX(Culverts!$AI:$CP,$S217,25)&\"\"\"H x \"&INDEX(Culverts!$AI:$CP,$S217,28)&\"’L \"&INDEX(Culverts!$AI:$CP,$S217,21)&\" \"&INDEX(Culverts!$AI:$CP,$S217,23)),(INDEX(Small_Bridges!$L:$BW,$S217,17)&\"'L x \"& INDEX(Small_Bridges!$L:$BW,$S217,21)&\"'W \"& INDEX(Small_Bridges!$L:$BW,$S217,16)&\" \"& INDEX(Small_Bridges!$L:$BW,$S217,15))),\"\")","v":""},null,null,null,null,null,null,null,{"$f":"IF(ISERROR(X217),\"\",IF($G$209=1,X217,INDEX(Small_Bridges!$L:$AW,$S217,18)))","v":""},null,{"$f":"IFERROR(INDEX(INDIRECT($S$72),$S217,IF($G$209=1,51,31)),\"\")","v":""},null,null,null,null,null,{"$f":"IFERROR(IF($G$48=1,MATCH(A217,Culverts!$AR:$AR,0),MATCH(A217,Small_Bridges!$T:$T,0)),\"Not Found\")","v":"Not Found"},{"$f":"INDEX(Culverts!$AI:$CP,$S217,20)","v":{"$error":"#VALUE!"}},{"$f":"INDEX(Culverts!$AI:$CP,$S217,24)","v":{"$error":"#VALUE!"}},{"$f":"INDEX(Culverts!$AI:$CP,$S217,25)","v":{"$error":"#VALUE!"}},{"$f":"INDEX(Culverts!$AI:$CP,$S217,23)","v":{"$error":"#VALUE!"}},{"$f":"VLOOKUP(W217,'Culvert Shapes'!$A$2:$B$9,2,FALSE)*U217*V217","v":{"$error":"#VALUE!"}}]
[null,null,{"$f":"IFERROR(IF($G$209=1,(INDEX(Culverts!$AI:$CP,$S218,20)&\" x \"&INDEX(Culverts!$AI:$CP,$S218,24)&\"\"\"W x \"&INDEX(Culverts!$AI:$CP,$S218,25)&\"\"\"H x \"&INDEX(Culverts!$AI:$CP,$S218,28)&\"’L \"&INDEX(Culverts!$AI:$CP,$S218,21)&\" \"&INDEX(Culverts!$AI:$CP,$S218,23)),(INDEX(Small_Bridges!$L:$BW,$S218,17)&\"'L x \"& INDEX(Small_Bridges!$L:$BW,$S218,21)&\"'W \"& INDEX(Small_Bridges!$L:$BW,$S218,16)&\" \"& INDEX(Small_Bridges!$L:$BW,$S218,15))),\"\")","v":""},null,null,null,null,null,null,null,{"$f":"IF(ISERROR(X218),\"\",IF($G$209=1,X218,INDEX(Small_Bridges!$L:$AW,$S218,18)))","v":""},null,{"$f":"IFERROR(INDEX(INDIRECT($S$72),$S218,IF($G$209=1,51,31)),\"\")","v":""},null,null,null,null,null,{"$f":"IFERROR(IF($G$48=1,MATCH(A218,Culverts!$AR:$AR,0),MATCH(A218,Small_Bridges!$T:$T,0)),\"Not Found\")","v":"Not Found"},{"$f":"INDEX(Culverts!$AI:$CP,$S218,20)","v":{"$error":"#VALUE!"}},{"$f":"INDEX(Culverts!$AI:$CP,$S218,24)","v":{"$error":"#VALUE!"}},{"$f":"INDEX(Culverts!$AI:$CP,$S218,25)","v":{"$error":"#VALUE!"}},{"$f":"INDEX(Culverts!$AI:$CP,$S218,23)","v":{"$error":"#VALUE!"}},{"$f":"VLOOKUP(W218,'Culvert Shapes'!$A$2:$B$9,2,FALSE)*U218*V218","v":{"$error":"#VALUE!"}}]
[null,null,{"$f":"IFERROR(IF($G$209=1,(INDEX(Culverts!$AI:$CP,$S219,20)&\" x \"&INDEX(Culverts!$AI:$CP,$S219,24)&\"\"\"W x \"&INDEX(Culverts!$AI:$CP,$S219,25)&\"\"\"H x \"&INDEX(Culverts!$AI:$CP,$S219,28)&\"’L \"&INDEX(Culverts!$AI:$CP,$S219,21)&\" \"&INDEX(Culverts!$AI:$CP,$S219,23)),(INDEX(Small_Bridges!$L:$BW,$S219,17)&\"'L x \"& INDEX(Small_Bridges!$L:$BW,$S219,21)&\"'W \"& INDEX(Small_Bridges!$L:$BW,$S219,16)&\" \"& INDEX(Small_Bridges!$L:$BW,$S219,15))),\"\")","v":""},null,null,null,null,null,null,null,{"$f":"IF(ISERROR(X219),\"\",IF($G$209=1,X219,INDEX(Small_Bridges!$L:$AW,$S219,18)))","v":""},null,{"$f":"IFERROR(INDEX(INDIRECT($S$72),$S219,IF($G$209=1,51,31)),\"\")","v":""},null,null,null,null,null,{"$f":"IFERROR(IF($G$48=1,MATCH(A219,Culverts!$AR:$AR,0),MATCH(A219,Small_Bridges!$T:$T,0)),\"Not Found\")","v":"Not Found"},{"$f":"INDEX(Culverts!$AI:$CP,$S219,20)","v":{"$error":"#VALUE!"}},{"$f":"INDEX(Culverts!$AI:$CP,$S219,24)","v":{"$error":"#VALUE!"}},{"$f":"INDEX(Culverts!$AI:$CP,$S219,25)","v":{"$error":"#VALUE!"}},{"$f":"INDEX(Culverts!$AI:$CP,$S219,23)","v":{"$error":"#VALUE!"}},{"$f":"VLOOKUP(W219,'Culvert Shapes'!$A$2:$B$9,2,FALSE)*U219*V219","v":{"$error":"#VALUE!"}}]
[null,null,{"$f":"IFERROR(IF($G$209=1,(INDEX(Culverts!$AI:$CP,$S220,20)&\" x \"&INDEX(Culverts!$AI:$CP,$S220,24)&\"\"\"W x \"&INDEX(Culverts!$AI:$CP,$S220,25)&\"\"\"H x \"&INDEX(Culverts!$AI:$CP,$S220,28)&\"’L \"&INDEX(Culverts!$AI:$CP,$S220,21)&\" \"&INDEX(Culverts!$AI:$CP,$S220,23)),(INDEX(Small_Bridges!$L:$BW,$S220,17)&\"'L x \"& INDEX(Small_Bridges!$L:$BW,$S220,21)&\"'W \"& INDEX(Small_Bridges!$L:$BW,$S220,16)&\" \"& INDEX(Small_Bridges!$L:$BW,$S220,15))),\"\")","v":""},null,null,null,null,null,null,null,{"$f":"IF(ISERROR(X220),\"\",IF($G$209=1,X220,INDEX(Small_Bridges!$L:$AW,$S220,18)))","v":""},null,{"$f":"IFERROR(INDEX(INDIRECT($S$72),$S220,IF($G$209=1,51,31)),\"\")","v":""},null,null,null,null,null,{"$f":"IFERROR(IF($G$48=1,MATCH(A220,Culverts!$AR:$AR,0),MATCH(A220,Small_Bridges!$T:$T,0)),\"Not Found\")","v":"Not Found"},{"$f":"INDEX(Culverts!$AI:$CP,$S220,20)","v":{"$error":"#VALUE!"}},{"$f":"INDEX(Culverts!$AI:$CP,$S220,24)","v":{"$error":"#VALUE!"}},{"$f":"INDEX(Culverts!$AI:$CP,$S220,25)","v":{"$error":"#VALUE!"}},{"$f":"INDEX(Culverts!$AI:$CP,$S220,23)","v":{"$error":"#VALUE!"}},{"$f":"VLOOKUP(W220,'Culvert Shapes'!$A$2:$B$9,2,FALSE)*U220*V220","v":{"$error":"#VALUE!"}}]
[null,null,{"$f":"IFERROR(IF($G$209=1,(INDEX(Culverts!$AI:$CP,$S221,20)&\" x \"&INDEX(Culverts!$AI:$CP,$S221,24)&\"\"\"W x \"&INDEX(Culverts!$AI:$CP,$S221,25)&\"\"\"H x \"&INDEX(Culverts!$AI:$CP,$S221,28)&\"’L \"&INDEX(Culverts!$AI:$CP,$S221,21)&\" \"&INDEX(Culverts!$AI:$CP,$S221,23)),(INDEX(Small_Bridges!$L:$BW,$S221,17)&\"'L x \"& INDEX(Small_Bridges!$L:$BW,$S221,21)&\"'W \"& INDEX(Small_Bridges!$L:$BW,$S221,16)&\" \"& INDEX(Small_Bridges!$L:$BW,$S221,15))),\"\")","v":""},null,null,null,null,null,null,null,{"$f":"IF(ISERROR(X221),\"\",IF($G$209=1,X221,INDEX(Small_Bridges!$L:$AW,$S221,18)))","v":""},null,{"$f":"IFERROR(INDEX(INDIRECT($S$72),$S221,IF($G$209=1,51,31)),\"\")","v":""},null,null,null,null,null,{"$f":"IFERROR(IF($G$48=1,MATCH(A221,Culverts!$AR:$AR,0),MATCH(A221,Small_Bridges!$T:$T,0)),\"Not Found\")","v":"Not Found"},{"$f":"INDEX(Culverts!$AI:$CP,$S221,20)","v":{"$error":"#VALUE!"}},{"$f":"INDEX(Culverts!$AI:$CP,$S221,24)","v":{"$error":"#VALUE!"}},{"$f":"INDEX(Culverts!$AI:$CP,$S221,25)","v":{"$error":"#VALUE!"}},{"$f":"INDEX(Culverts!$AI:$CP,$S221,23)","v":{"$error":"#VALUE!"}},{"$f":"VLOOKUP(W221,'Culvert Shapes'!$A$2:$B$9,2,FALSE)*U221*V221","v":{"$error":"#VALUE!"}}]
["Proposed Improvement",null,null,null,null,null,"Anticipated Funding",null,null,null,"Remarks"]
["Planned Year:",null,null,null,null,null,"Federal:",null,0]
["Project\nImprovement\nTypes",null,null,null,null,null,"State:",null,0]
[null,null,null,null,null,null,"County:",null,0]
[null,null,null,null,null,null,"Township:",null,0]
[null,null,null,null,null,null,"Private:",null,0]
[null,null,null,null,null,null,"RAIF Request:",null,0]
["Estimated Cost:","Estimated Cost:",null,null,null,null,"Total:",null,{"$f":"SUM(I223:J228)","v":0}]
["Road owner (township or county) must provide at least 20% of funding."]

{"sheet":"Culvert_Application Template","index":16,"n_rows":43,"n_cols":24,"rows_kept":43,"cut":false,"hidden":false,"merged":[[0,17,4,17],[2,13,2,14],[4,0,4,2],[4,3,4,6],[4,7,4,9],[4,10,4,14],[8,18,8,23],[9,0,9,1],[9,2,9,9],[9,10,9,11],[9,12,9,14],[5,0,6,2],[5,3,5,4],[5,5,5,6],[5,7,5,8],[5,9,5,13],[6,3,6,4],[6,5,6,6],[6,7,6,8],[6,9,6,13],[7,0,7,2],[7,3,7,14],[2,0,2,1],[8,0,8,2],[8,3,8,14],[0,0,0,14],[1,0,1,1],[1,2,1,4],[1,5,1,6],[1,7,1,10],[1,11,1,12],[1,13,1,14],[3,0,3,2],[3,3,3,6],[3,7,3,9],[3,10,3,14],[2,2,2,4],[2,5,2,6],[2,7,2,10],[2,11,2,12],[13,0,13,1],[13,2,13,9],[13,10,13,11],[13,12,13,14],[10,0,10,1],[10,2,10,9],[10,10,10,11],[10,12,10,14],[11,0,11,1],[11,2,11,9],[11,10,11,11],[11,12,11,14],[12,0,12,1],[12,2,12,9],[12,10,12,11],[12,12,12,14],[16,0,16,1],[16,2,16,9],[16,10,16,11],[16,12,16,14],[17,0,17,2],[17,3,17,12],[17,13,17,14],[14,0,14,1],[14,2,14,9],[14,10,14,11],[14,12,14,14],[15,0,15,1],[15,2,15,9],[15,10,15,11],[15,12,15,14],[18,0,18,2],[18,3,18,5],[18,6,18,8],[18,10,18,12],[18,13,18,14],[19,0,19,2],[19,3,19,5],[19,6,19,8],[19,10,19,12],[19,13,19,14],[27,0,27,2],[27,3,27,8],[27,9,27,10],[27,11,27,14],[28,0,28,14],[29,0,29,2],[29,3,29,4],[29,5,29,14],[34,3,34,4],[30,3,30,4],[30,5,37,14],[31,0,31,2],[31,3,31,4],[37,0,37,2],[37,3,37,4],[30,0,30,2],[42,13,42,14],[38,0,38,14],[39,0,39,14],[40,0,40,2],[40,3,40,14],[41,0,41,2],[41,3,41,9],[41,10,41,12],[41,13,41,14],[25,0,25,2],[25,3,25,14],[26,0,26,2],[26,3,26,4],[26,5,26,14],[0,16,42,16],[32,0,32,2],[32,3,32,4],[33,0,33,2],[33,3,33,4],[34,0,34,2],[35,0,35,2],[35,3,35,4],[36,0,36,2],[36,3,36,4],[22,0,22,2],[22,3,22,5],[22,6,22,8],[22,10,22,12],[22,13,22,14],[23,0,23,2],[42,0,42,2],[42,3,42,9],[42,10,42,12],[23,3,23,5],[23,6,23,8],[23,10,23,12],[23,13,23,14],[20,0,20,2],[20,3,20,5],[20,6,20,8],[24,0,24,2],[24,3,24,12],[24,13,24,14],[20,13,20,14],[21,0,21,2],[21,3,21,5],[21,6,21,8],[21,10,21,12],[21,13,21,14],[20,10,20,12]],"read":"row_number_cap"}
["Highway & Traffic Characteristics",null,null,null,null,null,null,null,null,null,null,null,null,null,null,null,"Culvert Application\nWorksheet Instructions\n\nEnter the Small Structure Number of the culverts you want included in your application in Cell A11. Culverts must lie within the group of culverts at this location. Repeat separate sheets for more than one location.\n\nThe spreadsheet will populate information that you have imported from the Small Structure Inventory database. \n\nProvide the additional information in the various tan boxes on this form. \n\nYou may print this form to a printer or a Portable Document Format (PDF) file. The form will print \n\nTo Add Photographs to This Report\n\nAppending photographs to this report can add valuable information. Because of the wide variety of possible photographs sizes and orientations, this worksheet cannot import photographs automatically. However, photographs can be inserted manually in Columns A - O below Row 44.\n\nTo insert photographs, select Insert, then Pictures, then From this Device. Excel will ask you to select photographs from the folder where you have stored your .jpg or other graphic format files. After you insert images, you can resize and arrange them to fit on a second page of this report.on one 8½ x 11 page. Type in appropriate labels into cells below the photographs.","Hidden columns\nS-X are used for calculations"]
["County:",null,{"$f":"INDEX(Culverts!$AI:$CN,$S$11,1)","v":{"$error":"#VALUE!"}},null,null,"Road Name:",null,{"$f":"INDEX(Culverts!$AI:$CN,$S$11,11)","v":{"$error":"#VALUE!"}},null,null,null,"Latitude:",null,{"$f":"INDEX(Culverts!$AI:$CN,$S$11,8)","v":{"$error":"#VALUE!"}}]
["Township:",null,{"$f":"INDEX(Culverts!$AI:$CN,$S$11,2)","v":{"$error":"#VALUE!"}},null,null,"Road System:",null,{"$f":"INDEX(Culverts!$AI:$CN,$S$11,3)","v":{"$error":"#VALUE!"}},null,null,null,"Longitude:",null,{"$f":"INDEX(Culverts!$AI:$CN,$S$11,9)","v":{"$error":"#VALUE!"}}]
["Maintenance Level:",null,null,{"$f":"INDEX(Culverts!$AI:$CN,$S$11,12)","v":{"$error":"#VALUE!"}},null,null,null,"Number Served;",null,null,{"$f":"INDEX(Culverts!$AI:$CN,$S$11,14)","v":{"$error":"#VALUE!"}}]
["Road Surface:",null,null,{"$f":"INDEX(Culverts!$AI:$CN,$S$11,13)","v":{"$error":"#VALUE!"}},null,null,null,"Detour Length:",null,null,{"$f":"INDEX(Culverts!$AI:$CN,$S$11,15)&\" miles\"","v":{"$error":"#VALUE!"}}]
["Traffic Uses\n(check all that apply)",null,null,null,null,null,null,null,null,"Estimated Average Daily Traffic (Optional):"]
[null,null,null,null,null,null,null,null,null,"Estimated Average Daily Trucks (Optional):"]
["Public Safety Impact:\n(please describe)"]
["Hydrological Impact:\n(please describe)",null,null,null,null,null,null,null,null,null,null,null,null,null,null,null,null,null,"WORK AREA FOR CULVERT INFORMATION"]
["Small Structure",null,"Structure Description",null,null,null,null,null,null,null,"Outlet (ft2)",null,"Overall Condition",null,null,null,null,null,"Row","Cells","Span","Rise","Shape","Factor"]
["Enter SSNS Here",null,{"$f":"IFERROR( T11&\" x \"&U11&\"\"\"W x \"&V11&\"\"\"H x \"& INDEX(Culverts!$AI:$CN,$S11,27)&\"’L \"& INDEX(Culverts!$AI:$CN,$S11,21)&\" \"&W11,\"\")","v":""},null,null,null,null,null,null,null,{"$f":"IFERROR(T11*U11*V11*X11,\"\")","v":""},null,{"$f":"IFERROR( INDEX(Culverts!$AI:$CN,$S11,51),\"\")","v":""},null,null,null,null,null,{"$f":"IFERROR(MATCH(A11,Culverts!$AR:$AR,0),\"Not Found\")","v":"Not Found"},{"$f":"INDEX(Culverts!$AI:$CN,$S11,20)","v":{"$error":"#VALUE!"}},{"$f":"INDEX(Culverts!$AI:$CN,$S11,24)","v":{"$error":"#VALUE!"}},{"$f":"INDEX(Culverts!$AI:$CN,$S11,25)","v":{"$error":"#VALUE!"}},{"$f":"INDEX(Culverts!$AI:$CN,$S11,23)","v":{"$error":"#VALUE!"}},{"$f":"VLOOKUP(W11,'Culvert Shapes'!$A$2:$B$9,2,FALSE)","v":{"$error":"#VALUE!"}}]
[null,null,{"$f":"IFERROR( T12&\" x \"&U12&\"\"\"W x \"&V12&\"\"\"H x \"& INDEX(Culverts!$AI:$CN,$S12,27)&\"’L \"& INDEX(Culverts!$AI:$CN,$S12,21)&\" \"&W12,\"\")","v":""},null,null,null,null,null,null,null,{"$f":"IFERROR(T12*U12*V12*X12,\"\")","v":""},null,{"$f":"IFERROR( INDEX(Culverts!$AI:$CN,$S12,51),\"\")","v":""},null,null,null,null,null,{"$f":"IFERROR(MATCH(A12,Culverts!$AR:$AR,0),\"Not Found\")","v":"Not Found"},{"$f":"INDEX(Culverts!$AI:$CN,$S12,20)","v":{"$error":"#VALUE!"}},{"$f":"INDEX(Culverts!$AI:$CN,$S12,24)","v":{"$error":"#VALUE!"}},{"$f":"INDEX(Culverts!$AI:$CN,$S12,25)","v":{"$error":"#VALUE!"}},{"$f":"INDEX(Culverts!$AI:$CN,$S12,23)","v":{"$error":"#VALUE!"}},{"$f":"VLOOKUP(W12,'Culvert Shapes'!$A$2:$B$9,2,FALSE)","v":{"$error":"#VALUE!"}}]
[null,null,{"$f":"IFERROR( T13&\" x \"&U13&\"\"\"W x \"&V13&\"\"\"H x \"& INDEX(Culverts!$AI:$CN,$S13,27)&\"’L \"& INDEX(Culverts!$AI:$CN,$S13,21)&\" \"&W13,\"\")","v":""},null,null,null,null,null,null,null,"",null,{"$f":"IFERROR( INDEX(Culverts!$AI:$CN,$S13,51),\"\")","v":""},null,null,null,null,null,{"$f":"IFERROR(MATCH(A13,Culverts!$AR:$AR,0),\"Not Found\")","v":"Not Found"},{"$f":"INDEX(Culverts!$AI:$CN,$S13,20)","v":{"$error":"#VALUE!"}},{"$f":"INDEX(Culverts!$AI:$CN,$S13,24)","v":{"$error":"#VALUE!"}},{"$f":"INDEX(Culverts!$AI:$CN,$S13,25)","v":{"$error":"#VALUE!"}},{"$f":"INDEX(Culverts!$AI:$CN,$S13,23)","v":{"$error":"#VALUE!"}},{"$f":"VLOOKUP(W13,'Culvert Shapes'!$A$2:$B$9,2,FALSE)","v":{"$error":"#VALUE!"}}]
[null,null,{"$f":"IFERROR( T14&\" x \"&U14&\"\"\"W x \"&V14&\"\"\"H x \"& INDEX(Culverts!$AI:$CN,$S14,27)&\"’L \"& INDEX(Culverts!$AI:$CN,$S14,21)&\" \"&W14,\"\")","v":""},null,null,null,null,null,null,null,"",null,{"$f":"IFERROR( INDEX(Culverts!$AI:$CN,$S14,51),\"\")","v":""},null,null,null,null,null,{"$f":"IFERROR(MATCH(A14,Culverts!$AR:$AR,0),\"Not Found\")","v":"Not Found"},{"$f":"INDEX(Culverts!$AI:$CN,$S14,20)","v":{"$error":"#VALUE!"}},{"$f":"INDEX(Culverts!$AI:$CN,$S14,24)","v":{"$error":"#VALUE!"}},{"$f":"INDEX(Culverts!$AI:$CN,$S14,25)","v":{"$error":"#VALUE!"}},{"$f":"INDEX(Culverts!$AI:$CN,$S14,23)","v":{"$error":"#VALUE!"}},{"$f":"VLOOKUP(W14,'Culvert Shapes'!$A$2:$B$9,2,FALSE)","v":{"$error":"#VALUE!"}}]
[null,null,{"$f":"IFERROR( T15&\" x \"&U15&\"\"\"W x \"&V15&\"\"\"H x \"& INDEX(Culverts!$AI:$CN,$S15,27)&\"’L \"& INDEX(Culverts!$AI:$CN,$S15,21)&\" \"&W15,\"\")","v":""},null,null,null,null,null,null,null,"",null,{"$f":"IFERROR( INDEX(Culverts!$AI:$CN,$S15,51),\"\")","v":""},null,null,null,null,null,{"$f":"IFERROR(MATCH(A15,Culverts!$AR:$AR,0),\"Not Found\")","v":"Not Found"},{"$f":"INDEX(Culverts!$AI:$CN,$S15,20)","v":{"$error":"#VALUE!"}},{"$f":"INDEX(Culverts!$AI:$CN,$S15,24)","v":{"$error":"#VALUE!"}},{"$f":"INDEX(Culverts!$AI:$CN,$S15,25)","v":{"$error":"#VALUE!"}},{"$f":"INDEX(Culverts!$AI:$CN,$S15,23)","v":{"$error":"#VALUE!"}},{"$f":"VLOOKUP(W15,'Culvert Shapes'!$A$2:$B$9,2,FALSE)","v":{"$error":"#VALUE!"}}]
[null,null,{"$f":"IFERROR( T16&\" x \"&U16&\"\"\"W x \"&V16&\"\"\"H x \"& INDEX(Culverts!$AI:$CN,$S16,27)&\"’L \"& INDEX(Culverts!$AI:$CN,$S16,21)&\" \"&W16,\"\")","v":""},null,null,null,null,null,null,null,"",null,{"$f":"IFERROR( INDEX(Culverts!$AI:$CN,$S16,51),\"\")","v":""},null,null,null,null,null,{"$f":"IFERROR(MATCH(A16,Culverts!$AR:$AR,0),\"Not Found\")","v":"Not Found"},{"$f":"INDEX(Culverts!$AI:$CN,$S16,20)","v":{"$error":"#VALUE!"}},{"$f":"INDEX(Culverts!$AI:$CN,$S16,24)","v":{"$error":"#VALUE!"}},{"$f":"INDEX(Culverts!$AI:$CN,$S16,25)","v":{"$error":"#VALUE!"}},{"$f":"INDEX(Culverts!$AI:$CN,$S16,23)","v":{"$error":"#VALUE!"}},{"$f":"VLOOKUP(W16,'Culvert Shapes'!$A$2:$B$9,2,FALSE)","v":{"$error":"#VALUE!"}}]
[null,null,{"$f":"IFERROR( T17&\" x \"&U17&\"\"\"W x \"&V17&\"\"\"H x \"& INDEX(Culverts!$AI:$CN,$S17,27)&\"’L \"& INDEX(Culverts!$AI:$CN,$S17,21)&\" \"&W17,\"\")","v":""},null,null,null,null,null,null,null,"",null,{"$f":"IFERROR( INDEX(Culverts!$AI:$CN,$S17,51),\"\")","v":""},null,null,null,null,null,{"$f":"IFERROR(MATCH(A17,Culverts!$AR:$AR,0),\"Not Found\")","v":"Not Found"},{"$f":"INDEX(Culverts!$AI:$CN,$S17,20)","v":{"$error":"#VALUE!"}},{"$f":"INDEX(Culverts!$AI:$CN,$S17,24)","v":{"$error":"#VALUE!"}},{"$f":"INDEX(Culverts!$AI:$CN,$S17,25)","v":{"$error":"#VALUE!"}},{"$f":"INDEX(Culverts!$AI:$CN,$S17,23)","v":{"$error":"#VALUE!"}},{"$f":"VLOOKUP(W17,'Culvert Shapes'!$A$2:$B$9,2,FALSE)","v":{"$error":"#VALUE!"}}]
["Structure Elements",null,null,"Improvement Description (check all that apply)",null,null,null,null,null,null,null,null,null,"Estimated Cost"]
["Culverts:",null,null,null,null,null,null,null,null,null,null,null,null,0]
["Culvert Lining:",null,null,null,null,null,null,null,null,null,null,null,null,0]
["End Treatments:",null,null,null,null,null,null,null,null,null,null,null,null,0]
["Channel:",null,null,null,null,null,null,null,null,null,null,null,null,0]
["Roadway Restoration:",null,null,null,null,null,null,null,null,null,null,null,null,0]
["Engineering:",null,null,null,null,null,null,null,null,null,null,null,null,0]
["Other (please describe):",null,null,null,null,null,null,null,null,null,null,null,null,0]
["Work Description:\n(Please explain the specific nature of the work in sufficient detail; attach extra sheets if necessary)"]
["Improvement Year:",null,null,null,null,"Please indicate the calendar year the improvement will be built"]
["Work Performed by:"]
["Funding Plan"]
[" Total Estimated Cost:",null,null,{"$f":"SUM(N19:N24)","v":0},null,"Please describe additional funding information below"]
["Funding Sources",null,null,"Amount"]
["Federal:",null,null,0]
["State:",null,null,0]
["County:",null,null,0]
["Township:",null,null,0]
["Private:",null,null,0]
["RAIF Request:",null,null,0]
["Total Funding:",null,null,{"$f":"SUM(D32:E37)","v":0}]
["Total Funding must equal Estimated Cost. Township or county share must be at least 20% of funds necessary to complete the project."]
["Application Approval and Submission"]
["Township Eligibility:"]
["Submitting Agency:",null,null,"Truro Township",null,null,null,null,null,null,"Agency Resolution Date:"]
["Submitted By:",null,null,null,null,null,null,null,null,null,"Submission Date:"]

{"sheet":"Bridge Application Template","index":17,"n_rows":42,"n_cols":19,"rows_kept":42,"cut":false,"hidden":false,"merged":[[37,3,37,8],[38,3,38,8],[37,9,37,12],[38,9,38,12],[0,0,0,14],[1,0,1,1],[1,2,1,4],[1,5,1,6],[1,7,1,10],[1,11,1,12],[1,13,1,14],[3,0,3,2],[3,3,3,6],[3,7,3,9],[3,10,3,14],[4,0,4,2],[4,3,4,6],[4,7,4,9],[4,10,4,14],[2,0,2,1],[2,2,2,4],[2,5,2,6],[2,7,2,10],[2,11,2,12],[2,13,2,14],[5,0,6,2],[5,3,5,4],[5,5,5,6],[5,7,5,8],[5,9,5,13],[6,3,6,4],[6,5,6,6],[6,7,6,8],[6,9,6,13],[10,0,10,1],[10,2,10,9],[10,10,10,11],[10,12,10,14],[11,0,11,2],[11,3,11,12],[11,13,11,14],[7,0,7,2],[7,3,7,14],[8,0,8,2],[8,3,8,14],[9,0,9,1],[9,2,9,9],[9,10,9,11],[9,12,9,14],[12,0,12,2],[12,3,12,5],[12,6,12,9],[12,10,12,12],[12,13,12,14],[13,0,13,2],[13,3,13,5],[13,6,13,9],[13,10,13,12],[13,13,13,14],[14,0,14,2],[14,3,14,5],[14,6,14,9],[14,10,14,12],[14,13,14,14],[15,0,15,2],[15,3,15,5],[15,6,15,9],[15,10,15,12],[15,13,15,14],[24,0,24,14],[25,0,25,2],[25,3,25,4],[25,5,25,14],[16,0,16,2],[16,3,16,5],[16,6,16,9],[16,10,16,12],[16,13,16,14],[17,0,17,2],[17,3,17,5],[17,6,17,9],[17,10,17,12],[17,13,17,14],[0,17,4,17],[28,0,28,2],[28,3,28,4],[29,0,29,2],[29,3,29,4],[30,0,30,2],[31,0,31,2],[31,3,31,4],[26,0,26,2],[20,0,20,2],[20,3,20,12],[20,13,20,14],[21,0,21,2],[21,3,21,14],[22,0,22,2],[22,3,22,4],[30,3,30,4],[26,3,26,4],[26,5,33,14],[27,0,27,2],[27,3,27,4],[18,0,18,2],[18,3,18,5],[18,6,18,9],[0,16,38,16],[38,0,38,2],[38,13,38,14],[34,0,34,14],[35,0,35,14],[36,0,36,2],[36,3,36,14],[37,0,37,2],[37,13,37,14],[33,0,33,2],[33,3,33,4],[18,10,18,12],[18,13,18,14],[19,0,19,2],[19,3,19,5],[19,6,19,9],[19,10,19,12],[19,13,19,14],[32,0,32,2],[32,3,32,4],[23,3,23,10],[22,5,22,14],[23,0,23,2],[23,11,23,14]],"read":"row_number_cap"}
["Highway & Traffic Characteristics",null,null,null,null,null,null,null,null,null,null,null,null,null,null,null,"Bridge Application\nWorksheet Instructions\n\nEnter the Small Structure Number of the small bridge you want included in your application in Cell A11. \n\nThe spreadsheet will populate information that you have imported from the Small Structure Inventory database. \n\nProvide the additional information in the various tan boxes on this form. \n\nYou may print this form to a printer or a Portable Document Format (PDF) file. The form will print on one 8½ x 11 page.\n\nTo Add Photographs to This Report\n\nAppending photographs to this report can add valuable information. Because of the wide variety of possible photographs sizes and orientations, this worksheet cannot import photographs automatically. However, photographs can be inserted manually in Columns A - O below Row 40.\n\nTo insert photographs, select Insert, then Pictures, then From this Device. Excel will ask you to select photographs from the folder where you have stored your .jpg or other graphic format files. After you insert images, you can resize and arrange them to fit on a second page of this report.","Hidden column S is used for calculations"]
["County",null,{"$f":"INDEX(Small_Bridges!$L:$AW,$S$11,1)","v":{"$error":"#VALUE!"}},null,null,"Road Name",null,{"$f":"INDEX(Small_Bridges!$L:$AW,$S$11,10)","v":{"$error":"#VALUE!"}},null,null,null,"Latitude",null,{"$f":"INDEX(Small_Bridges!$L:$AW,$S$11,7)","v":{"$error":"#VALUE!"}}]
["Township",null,{"$f":"INDEX(Small_Bridges!$L:$AW,$S$11,2)","v":{"$error":"#VALUE!"}},null,null,"Road System",null,{"$f":"INDEX(Small_Bridges!$L:$AW,$S$11,3)","v":{"$error":"#VALUE!"}},null,null,null,"Longitude",null,{"$f":"INDEX(Small_Bridges!$L:$AW,$S$11,8)","v":{"$error":"#VALUE!"}}]
["Maintenance Level",null,null,{"$f":"INDEX(Small_Bridges!$L:$AW,$S$11,11)","v":{"$error":"#VALUE!"}},null,null,null,"Number Served",null,null,{"$f":"INDEX(Small_Bridges!$L:$AW,$S$11,13)","v":{"$error":"#VALUE!"}}]
["Road Surface",null,null,{"$f":"INDEX(Small_Bridges!$L:$AW,$S$11,12)","v":{"$error":"#VALUE!"}},null,null,null,"Detour Length",null,null,{"$f":"INDEX(Small_Bridges!$L:$AW,$S$11,14)&\" miles\"","v":{"$error":"#VALUE!"}}]
["Traffic Uses\n(check all that apply)",null,null,null,null,null,null,null,null,"Estimated Average Daily Traffic (Optional) "]
[null,null,null,null,null,null,null,null,null,"Estimated Average Daily Trucks (Optional)"]
["Public Safety Impact\n(please describe)"]
["Hydrological Impact\n(please describe)",null,null,null,null,null,null,null,null,null,null,null,null,null,null,null,null,null,"WORK AREA"]
["Small Structure",null,"Structure Description",null,null,null,null,null,null,null,"NBIS Length",null,"Overall Condition",null,null,null,null,null,"Row"]
["Enter SSN Here",null,{"$f":"IFERROR(INDEX(Small_Bridges!$L:$AW,$S11,17)&\"'L x \"& INDEX(Small_Bridges!$L:$AW,$S11,21)&\"'W \"& INDEX(Small_Bridges!$L:$AW,$S11,16)&\" \"& INDEX(Small_Bridges!$L:$AW,$S11,15),\"\")","v":""},null,null,null,null,null,null,null,{"$f":"INDEX(Small_Bridges!$L:$AW,$S11,18)&\"'\"","v":{"$error":"#VALUE!"}},null,{"$f":"IFERROR( INDEX(Small_Bridges!$L:$AW,$S11,31),\"\")","v":""},null,null,null,null,null,{"$f":"IFERROR(MATCH(A11,Small_Bridges!$T:$T,0),\"Not Found\")","v":"Not Found"}]
["Structure Elements",null,null,"Improvement Description (check all that apply)",null,null,null,null,null,null,null,null,null,"Estimated Cost"]
["Bridge Deck",null,null,null,null,null,null,null,null,null,null,null,null,0]
["Superstructure",null,null,null,null,null,null,null,null,null,null,null,null,0]
["Substructure",null,null,null,null,null,null,null,null,null,null,null,null,0]
["Bridge Rail",null,null,null,null,null,null,null,null,null,null,null,null,0]
["Approach Rail",null,null,null,null,null,null,null,null,null,null,null,null,0]
["Channel",null,null,null,null,null,null,null,null,null,null,null,null,0]
["Roadway Restoration",null,null,null,null,null,null,null,null,null,null,null,null,0]
["Engineering",null,null,null,null,null,null,null,null,null,null,null,null,0]
["Other (please describe)",null,null,null,null,null,null,null,null,null,null,null,null,0]
["Work Description\n(Please explain the specific nature of the work in sufficient detail; attach extra sheets if necessary)"]
["Improvement Year",null,null,null,null,"Please indicate the calendar year the improvement will be built"]
["Work Performed by"]
["Funding Plan"]
[" Total Estimated Cost",null,null,{"$f":"SUM(N13:N20)","v":0},null,"Please describe additional funding information below"]
["Funding Sources",null,null,"Amount"]
["Federal"]
["State"]
["County"]
["Township"]
["Private"]
["RAIF Request"]
["Total Funding",null,null,{"$f":"SUM(D28:E33)","v":0}]
["Total Funding must equal Estimated Cost. Township or county share must be at least 20% of funds necessary to complete the project."]
["Application Approval and Submission"]
["Township Eligibility"]
["Submitting Agency",null,null,null,null,null,null,null,null,"Agency Resolution Date"]
["Submitted By",null,null,null,null,null,null,null,null,"Submission Date"]
[]
[]
["`"]